[#377713] [test-only] p10 FAILED (try 10) cmrc.git=2.0.1-alt1 libfmt.git=10.2.1-alt1 vcpkg.git=2023.09.15-alt1 ...

Girar awaiter (alton) girar-builder at altlinux.org
Thu Mar 13 14:38:32 MSK 2025


https://git.altlinux.org/tasks/377713/logs/events.10.1.log
https://packages.altlinux.org/tasks/377713

subtask  name    aarch64  armh    i586  x86_64
   #560  spdlog        ?     ?  failed  failed

2025-Mar-13 11:37:30 :: test-only task #377713 for p10 resumed by alton:
2025-Mar-13 11:37:30 :: message: new_package
#100 build 2.0.1-alt1 from /gears/c/cmrc.git fetched at 2025-Mar-12 08:39:08 from p11
#200 build 10.2.1-alt1 from /gears/l/libfmt.git fetched at 2025-Mar-12 08:40:16 from p11
#300 build 2023.09.15-alt1 from /gears/v/vcpkg.git fetched at 2025-Mar-12 08:41:10 from p11
#400 removed
#440 removed
#460 removed
#470 removed
#500 removed
#540 removed
#560 build 1.13.0-alt3 from /gears/s/spdlog.git fetched at 2025-Mar-13 11:36:50 from sisyphus
#600 build 3.1.3-alt1 from /gears/b/bear.git fetched at 2025-Mar-12 08:44:58 from p11
#640 removed
#660 build 1.8.1-alt1 from /gears/g/gerbera.git fetched at 2025-Mar-13 11:17:53 from p10
#700 build 1.3.7-alt0.p10.1 from /people/alton/packages/rustdesk.git fetched at 2025-Mar-12 08:46:21
2025-Mar-13 11:37:30 :: created build repo
2025-Mar-13 11:37:31 :: [x86_64] #100 cmrc.git 2.0.1-alt1: build start
2025-Mar-13 11:37:31 :: [i586] #100 cmrc.git 2.0.1-alt1: build start
2025-Mar-13 11:37:31 :: [aarch64] #100 cmrc.git 2.0.1-alt1: build start
2025-Mar-13 11:37:31 :: [armh] #100 cmrc.git 2.0.1-alt1: build start
2025-Mar-13 11:37:42 :: [i586] #100 cmrc.git 2.0.1-alt1: build OK (cached)
2025-Mar-13 11:37:43 :: [i586] #200 libfmt.git 10.2.1-alt1: build start
2025-Mar-13 11:37:43 :: [x86_64] #100 cmrc.git 2.0.1-alt1: build OK (cached)
2025-Mar-13 11:37:43 :: [x86_64] #200 libfmt.git 10.2.1-alt1: build start
2025-Mar-13 11:37:51 :: [aarch64] #100 cmrc.git 2.0.1-alt1: build OK (cached)
2025-Mar-13 11:37:52 :: [aarch64] #200 libfmt.git 10.2.1-alt1: build start
2025-Mar-13 11:37:54 :: [i586] #200 libfmt.git 10.2.1-alt1: build OK (cached)
2025-Mar-13 11:37:54 :: [i586] #300 vcpkg.git 2023.09.15-alt1: build start
2025-Mar-13 11:37:54 :: [x86_64] #200 libfmt.git 10.2.1-alt1: build OK (cached)
2025-Mar-13 11:37:54 :: [x86_64] #300 vcpkg.git 2023.09.15-alt1: build start
2025-Mar-13 11:38:00 :: [armh] #100 cmrc.git 2.0.1-alt1: build OK (cached)
2025-Mar-13 11:38:00 :: [armh] #200 libfmt.git 10.2.1-alt1: build start
2025-Mar-13 11:38:05 :: [i586] #300 vcpkg.git 2023.09.15-alt1: build OK (cached)
2025-Mar-13 11:38:05 :: [i586] #560 spdlog.git 1.13.0-alt3: build start
2025-Mar-13 11:38:06 :: [x86_64] #300 vcpkg.git 2023.09.15-alt1: build OK (cached)
2025-Mar-13 11:38:06 :: [x86_64] #560 spdlog.git 1.13.0-alt3: build start
2025-Mar-13 11:38:11 :: [aarch64] #200 libfmt.git 10.2.1-alt1: build OK (cached)
2025-Mar-13 11:38:11 :: [aarch64] #300 vcpkg.git 2023.09.15-alt1: build start
[i586] CMake Error at /usr/share/cmake/Modules/ExternalProject.cmake:2540 (message):
[i586]   error: could not find git for clone of catch2-populate
[i586] Call Stack (most recent call first):
2025-Mar-13 11:38:25 :: [i586] spdlog.git 1.13.0-alt3: remote: build failed
2025-Mar-13 11:38:25 :: [i586] #560 spdlog.git 1.13.0-alt3: build FAILED
2025-Mar-13 11:38:25 :: [i586] requesting cancellation of task processing
[x86_64] CMake Error at /usr/share/cmake/Modules/ExternalProject.cmake:2540 (message):
[x86_64]   error: could not find git for clone of catch2-populate
[x86_64] Call Stack (most recent call first):
2025-Mar-13 11:38:25 :: [x86_64] spdlog.git 1.13.0-alt3: remote: build failed
2025-Mar-13 11:38:25 :: [x86_64] #560 spdlog.git 1.13.0-alt3: build FAILED
2025-Mar-13 11:38:28 :: [armh] #200 libfmt.git 10.2.1-alt1: build OK (cached)
2025-Mar-13 11:38:28 :: [armh] task processing CANCELLED
2025-Mar-13 11:38:31 :: [aarch64] #300 vcpkg.git 2023.09.15-alt1: build OK (cached)
2025-Mar-13 11:38:31 :: [aarch64] task processing CANCELLED
2025-Mar-13 11:38:25 :: [i586] build FAILED
2025-Mar-13 11:38:25 :: [x86_64] build FAILED
2025-Mar-13 11:38:29 :: [armh] build FAILED
2025-Mar-13 11:38:32 :: [aarch64] build FAILED
2025-Mar-13 11:38:32 :: task #377713 for p10 FAILED


More information about the Sisyphus-incominger mailing list