[#377815] [test-only] p10 FAILED qpdf.git=11.9.1-alt1

Girar awaiter (ded) girar-builder at altlinux.org
Thu Mar 13 12:38:23 MSK 2025


https://git.altlinux.org/tasks/377815/logs/events.1.1.log
https://packages.altlinux.org/tasks/377815

subtask  name  aarch64  armh  i586  x86_64
   #200  qpdf     5:08  7:31  3:20    3:00

2025-Mar-13 09:28:42 :: test-only task #377815 for p10 started by ded:
#100 removed
#200 build 11.9.1-alt1 from /gears/q/qpdf.git fetched at 2025-Mar-13 09:28:19 from p11
2025-Mar-13 09:28:44 :: [x86_64] #200 qpdf.git 11.9.1-alt1: build start
2025-Mar-13 09:28:44 :: [i586] #200 qpdf.git 11.9.1-alt1: build start
2025-Mar-13 09:28:44 :: [aarch64] #200 qpdf.git 11.9.1-alt1: build start
2025-Mar-13 09:28:44 :: [armh] #200 qpdf.git 11.9.1-alt1: build start
2025-Mar-13 09:31:44 :: [x86_64] #200 qpdf.git 11.9.1-alt1: build OK
2025-Mar-13 09:32:04 :: [i586] #200 qpdf.git 11.9.1-alt1: build OK
2025-Mar-13 09:33:52 :: [aarch64] #200 qpdf.git 11.9.1-alt1: build OK
2025-Mar-13 09:36:15 :: [armh] #200 qpdf.git 11.9.1-alt1: build OK
2025-Mar-13 09:36:36 :: #200: qpdf.git 11.9.1-alt1: build check OK
2025-Mar-13 09:36:37 :: build check OK
2025-Mar-13 09:36:46 :: noarch check OK
2025-Mar-13 09:36:48 :: plan: src +1 -1 =19025, aarch64 +5 -5 =31711, armh +5 -5 =29551, i586 +5 -5 =32028, noarch +0 -1 =20416, x86_64 +5 -5 =33051
#200 qpdf 10.4.0-alt1 -> 11.9.1-alt1
 Mon Jun 10 2024 Anton Farygin <rider at altlinux.ru> 11.9.1-alt1
 - 11.9.1
 Sun Mar 03 2024 Anton Farygin <rider at altlinux.ru> 11.9.0-alt1
 - 11.9.0
 Sat Jan 27 2024 Anton Farygin <rider at altlinux.ru> 11.8.0-alt1
 - 11.8.0
 Thu Nov 02 2023 Anton Farygin <rider at altlinux.ru> 11.6.3-alt1
 - 11.6.3
 Tue May 23 2023 Anton Farygin <rider at altlinux.ru> 11.4.0-alt1
 - 11.4.0
 [...]
2025-Mar-13 09:37:29 :: patched apt indices
2025-Mar-13 09:37:39 :: created next repo
2025-Mar-13 09:37:46 :: duplicate provides check OK
	x86_64: NEW unmet dependencies detected:
 cups-filters#1.28.17-alt3:p10+359118.200.3.1 at 1729792332                          libqpdf.so.28()(64bit) >= set:ohknCY1ZeTC2gfbGKFnkqO4gE3FkyrPiIwnBJZIJfWGOC5gfhGmlSglZDDVfbibW5VhaZ06SEMofRmk1H0MQXksAE7cQXPeexLUdyuQ55zxsb6MydNwvlgLPMcJE3aUZkJphHbUgp852ABESk5Hnt7JNnAXQwcdXCnqYI4SQeH2MZcbceNFV3PIuIDgeF57OZ0ggdp2ZC4wLPgGSndUynDJi0udiSZKjdh7ZIC4v4Q1Nd6q2uGRP7c6OQeB27Y9AbsnEK8cslrTHrySFb4avNVW83x3wWtfRlq3uZu7iZoCdfldC6q5om
 cups-filters#1.28.17-alt3:p10+359118.200.3.1 at 1729792332                          libqpdf.so.28(LIBQPDF_28)(64bit)
 cups-filters-debuginfo#1.28.17-alt3:p10+359118.200.3.1 at 1729792332                debug64(libqpdf.so.28)
 libcsppdf#0.2-alt2:p10+372137.200.5.2 at 1739563282                                 libqpdf.so.28()(64bit) >= set:ojiT8BYlR6gWUgbmJmkojv31NkHhKP4lbVcDjrNgZHILSeMk6WoZf7XzJpB9txGMlZtK7RgHag84JZahQeVMvnZzJJf3
 libcsppdf#0.2-alt2:p10+372137.200.5.2 at 1739563282                                 libqpdf.so.28(LIBQPDF_28)(64bit)
 libcsppdf-debuginfo#0.2-alt2:p10+372137.200.5.2 at 1739563282                       debug64(libqpdf.so.28)
 pdfcspcli#0.2-alt2:p10+372137.200.5.2 at 1739563282                                 libqpdf.so.28()(64bit) >= set:omjWgjYrDDut1
 python3-module-pikepdf#2.12.2-alt1:sisyphus+274789.100.1.1 at 1624095126            libqpdf.so.28()(64bit) >= set:ogOGZl4SXHQFpaZ99e7XN54gy1uShbRu4w4mAtSKfhYGqgh9iNZE7w1DmIdbc9mA1VcZw3KjKYc5N9CtxR5SNYVNvDmPIg5UmVzsDVCy76r6ZdI7JeQfJQIstAmqHlGkFqwGwQ75qb20iWV4GORZpQCX9jiW4Z1lAPCnXnCZFzG3aWdvfcNMmc8DvZiOCkyyN4sN8NdgoRcRpZ09TOr5RtpAqyO3jJMq2LcwHaG4qZgxZIZ6OxCZbgDJM3hW9EN0v9vQsXVJxVs9TwaTbQAWLfLKDZDwhJ0mQZqc2Fbedvoqe0gmgUgK3giIu6iSXneZKPGv8shLegzN0plBIXeXLbgWcfMvghI5U4BN3bSiPvOBazKPCyf2CZFP4ITRdyoV1jq5JY2bYxm0mfGRG2N1Z9rXKa2zFy4nn5hxidg7YMzxbrLevOjGCBO4raUAbccGO3DHmc2NdOy684zWatBV1tVskGoMuZDO7cdjoZsul8eMEvFzgNdM4VB72UtwqofNZBp0
 python3-module-pikepdf#2.12.2-alt1:sisyphus+274789.100.1.1 at 1624095126            libqpdf.so.28(LIBQPDF_28)(64bit)
 python3-module-pikepdf-debuginfo#2.12.2-alt1:sisyphus+274789.100.1.1 at 1624095126  debug64(libqpdf.so.28)
	i586: NEW unmet dependencies detected:
 cups-filters#1.28.17-alt3:p10+359118.200.3.1 at 1729792341                          libqpdf.so.28 >= set:ohknCPNe5wumktPksv0njC02t8Bisrmy5YGIRJShDUzKGIp1QjAGlBdkRZJpZjbibW5VhaZ06WzGSyao50CuDyz4Z0AGJ9Y5LhQENxsb6MydNwvlgLPMcJE3aUZkJphHbUgp852ABESk5Hnt7JNnAXQwcdXCnqYI4uhlrcpl0KDnosyjP7CjKFh8ZA8DQy3Vu02G9jUT80vDxkMtVRpH4wnzAZfZkdh7ZIC4v4Q1Nd6q2uGRP7c6OQeB27Y9AbsnEK8cslrTHrySFb4avNVW83x3wWtfRlq3uZu7iZoCdfldC6q5omLR2
 cups-filters#1.28.17-alt3:p10+359118.200.3.1 at 1729792341                          libqpdf.so.28(LIBQPDF_28)
 cups-filters-debuginfo#1.28.17-alt3:p10+359118.200.3.1 at 1729792341                debug(libqpdf.so.28)
 libcsppdf#0.2-alt2:p10+372137.200.5.2 at 1739563286                                 libqpdf.so.28 >= set:ojiT8BYlR6gWUgbmJmkojv31NkHhKP4lbVcDjrNgZHILSeMk6WoZf7XzJpB9txGMlZtK7RgHag84JZahQeVMvnZzJJf3
 libcsppdf#0.2-alt2:p10+372137.200.5.2 at 1739563286                                 libqpdf.so.28(LIBQPDF_28)
 libcsppdf-debuginfo#0.2-alt2:p10+372137.200.5.2 at 1739563286                       debug(libqpdf.so.28)
 pdfcspcli#0.2-alt2:p10+372137.200.5.2 at 1739563286                                 libqpdf.so.28 >= set:omjWgjYrDDut1
 python3-module-pikepdf#2.12.2-alt1:sisyphus+274789.100.1.1 at 1624095121            libqpdf.so.28 >= set:ogOGZl4SXHQFpaZ99e7XN54gy1uShbRu4w4mAdajLG6kkykYfu06sqNSI8dZ5NbOwsCvoMtOBDFKBEx4PKMW2XoZszZKQqC5G0TavAXcTkYMoPELpfqtEvqFpVW8JQmHkFiR0l1FfaQm4CZw0nts2lVqZAqPZ4CAQ9WzaOpPHZbcZz7l7kQrZux96Sy1VYPnAtqp2KoAU68IqCWIu8VmuHEqcbB7CqxR4up0nlk9QYxMvKTA3dXnEPmUL9e6EEBJDT6CPBs3GsLgjGZKPHXVZxokbw5JLO8AKUQAFPxnC30A54eAX0A4HDxAZeneZKPGv8shLegzN0plBIXeXLbgWcfMvghI5U4BN3bSiPvOBazKPCyf2CZFP4ITRdyoV1jq5JY2bYxm0mfGRG2N1Z9rXKa2zFy4nn5hxidg7YMzxbrLevOjGCBO4raUAbccGO3DHmc2NdOy684zWatBV1tVskGoMuZDO7cdjoZsul8eMEvFzgNdUN65Kmu8wT1GxZ4YvB1
 python3-module-pikepdf#2.12.2-alt1:sisyphus+274789.100.1.1 at 1624095121            libqpdf.so.28(LIBQPDF_28)
 python3-module-pikepdf-debuginfo#2.12.2-alt1:sisyphus+274789.100.1.1 at 1624095121  debug(libqpdf.so.28)
	aarch64: NEW unmet dependencies detected:
 cups-filters#1.28.17-alt3:p10+359118.200.3.1 at 1729792393                          libqpdf.so.28()(64bit) >= set:ohknCY1ZeTC2gfbGKFnkqO4gE3FkyrPiIwnBJZIJfWGOC5gfhGmlSglZDDVfbibW5VhaZ06SEMofRmk1H0MQXksAE7cQXPeexLUdyuQ55zxsb6MydNwvlgLPMcJE3aUZkJphHbUgp852ABESk5Hnt7JNnAXQwcdXCnqYI4SQeH2MZcbceNFV3PIuIDgeF57OZ0ggdp2ZC4wLPgGSndUynDJi0udiSZKjdh7ZIC4v4Q1Nd6q2uGRP7c6OQeB27Y9AbsnEK8cslrTHrySFb4avNVW83x3wWtfRlq3uZu7iZoCdfldC6q5om
 cups-filters#1.28.17-alt3:p10+359118.200.3.1 at 1729792393                          libqpdf.so.28(LIBQPDF_28)(64bit)
 cups-filters-debuginfo#1.28.17-alt3:p10+359118.200.3.1 at 1729792393                debug64(libqpdf.so.28)
 libcsppdf#0.2-alt2:p10+372137.200.5.2 at 1739563329                                 libqpdf.so.28()(64bit) >= set:ojiT8BYlR6gWUgbmJmkojv31NkHhKP4lbVcDjrNgZHILSeMk6WoZf7XzJpB9txGMlZtK7RgHag84JZahQeVMvnZzJJf3
 libcsppdf#0.2-alt2:p10+372137.200.5.2 at 1739563329                                 libqpdf.so.28(LIBQPDF_28)(64bit)
 libcsppdf-debuginfo#0.2-alt2:p10+372137.200.5.2 at 1739563329                       debug64(libqpdf.so.28)
 pdfcspcli#0.2-alt2:p10+372137.200.5.2 at 1739563329                                 libqpdf.so.28()(64bit) >= set:omjWgjYrDDut1
 python3-module-pikepdf#2.12.2-alt1:sisyphus+274789.100.1.1 at 1624095141            libqpdf.so.28()(64bit) >= set:ogOGZl4SXHQFpaZ99e7XN54gy1uShbRu4w4mAtSKfhYGqgh9iNZE7w1DmIdbc9mA1VcZw3KjKYc5N9CtxR5SNYVNvDmPIg5UmVzsDVCy76r6ZdI7JeQfJQIstAmqHlGkFqwGwQ75qb20iWV4GORZpQCX9jiW4Z1lAPCnXnCZFzG3aWdvfcNMmc8DvZiOCkyyN4sN8NdgoRcRpZ09TOr5RtpAqyO3jJMq2LcwHaG4qZgxZIZ6OxCZbgDJM3hW9EN0v9vQsXVJxVs9TwaTbQAWLfLKDZDwhJ0mQZqc2Fbedvoqe0gmgUgK3giIu6iSXneZKPGv8shLegzN0plBIXeXLbgWcfMvghI5U4BN3bSiPvOBazKPCyf2CZFP4ITRdyoV1jq5JY2bYxm0mfGRG2N1Z9rXKa2zFy4nn5hxidg7YMzxbrLevOjGCBO4raUAbccGO3DHmc2NdOy684zWatBV1tVskGoMuZDO7cdjoZsul8eMEvFzgNdM4VB72UtwqofNZBp0
 python3-module-pikepdf#2.12.2-alt1:sisyphus+274789.100.1.1 at 1624095141            libqpdf.so.28(LIBQPDF_28)(64bit)
 python3-module-pikepdf-debuginfo#2.12.2-alt1:sisyphus+274789.100.1.1 at 1624095141  debug64(libqpdf.so.28)
	armh: NEW unmet dependencies detected:
 cups-filters#1.28.17-alt3:p10+359118.200.3.1 at 1729792483                          libqpdf.so.28 >= set:ohknCPNe5wumktPksv0njC02t8Bisrmy5YGIRJShDUzKGIp1QjAGlBdkRZJpZjbibW5VhaZ06WzGSyao50CuDyz4Z0AGJ9Y5LhQENxsb6MydNwvlgLPMcJE3aUZkJphHbUgp852ABESk5Hnt7JNnAXQwcdXCnqYI4uhlrcpl0KDnosyjP7CjKFh8ZA8DQy3Vu02G9jUT80vDxkMtVRpH4wnzAZfZkdh7ZIC4v4Q1Nd6q2uGRP7c6OQeB27Y9AbsnEK8cslrTHrySFb4avNVW83x3wWtfRlq3uZu7iZoCdfldC6q5omLR2
 cups-filters#1.28.17-alt3:p10+359118.200.3.1 at 1729792483                          libqpdf.so.28(LIBQPDF_28)
 cups-filters-debuginfo#1.28.17-alt3:p10+359118.200.3.1 at 1729792483                debug(libqpdf.so.28)
 libcsppdf#0.2-alt2:p10+372137.200.5.2 at 1739563349                                 libqpdf.so.28 >= set:ojiT8BYlR6gWUgbmJmkojv31NkHhKP4lbVcDjrNgZHILSeMk6WoZf7XzJpB9txGMlZtK7RgHag84JZahQeVMvnZzJJf3
 libcsppdf#0.2-alt2:p10+372137.200.5.2 at 1739563349                                 libqpdf.so.28(LIBQPDF_28)
 libcsppdf-debuginfo#0.2-alt2:p10+372137.200.5.2 at 1739563349                       debug(libqpdf.so.28)
 pdfcspcli#0.2-alt2:p10+372137.200.5.2 at 1739563349                                 libqpdf.so.28 >= set:omjWgjYrDDut1
 python3-module-pikepdf#2.12.2-alt1:sisyphus+274789.100.1.1 at 1624095257            libqpdf.so.28 >= set:ogOGZl4SXHQFpaZ99e7XN54gy1uShbRu4w4mAdajLG6kkykYfu06sqNSI8dZ5NbOwsCvoMtOBDFKBEx4PKMW2XoZszZKQqC5G0TavAXcTkYMoPELpfqtEvqFpVW8JQmHkFiR0l1FfaQm4CZw0nts2lVqZAqPZ4CAQ9WzaOpPHZbcZz7l7kQrZux96Sy1VYPnAtqp2KoAU68IqCWIu8VmuHEqcbB7CqxR4up0nlk9QYxMvKTA3dXnEPmUL9e6EEBJDT6CPBs3GsLgjGZKPHXVZxokbw5JLO8AKUQAFPxnC30A54eAX0A4HDxAZeneZKPGv8shLegzN0plBIXeXLbgWcfMvghI5U4BN3bSiPvOBazKPCyf2CZFP4ITRdyoV1jq5JY2bYxm0mfGRG2N1Z9rXKa2zFy4nn5hxidg7YMzxbrLevOjGCBO4raUAbccGO3DHmc2NdOy684zWatBV1tVskGoMuZDO7cdjoZsul8eMEvFzgNdUN65Kmu8wT1GxZ4YvB1
 python3-module-pikepdf#2.12.2-alt1:sisyphus+274789.100.1.1 at 1624095257            libqpdf.so.28(LIBQPDF_28)
 python3-module-pikepdf-debuginfo#2.12.2-alt1:sisyphus+274789.100.1.1 at 1624095257  debug(libqpdf.so.28)
	ACLs of affected packages (3):
 cups-filters
 pdfcsp
 python3-module-pikepdf
2025-Mar-13 09:38:23 :: unmets: x86_64 +10 -0 =10, i586 +10 -0 =10, aarch64 +10 -0 =14, armh +10 -0 =28
2025-Mar-13 09:38:23 :: dependencies check FAILED
2025-Mar-13 09:38:23 :: task #377815 for p10 FAILED


More information about the Sisyphus-incominger mailing list