[#377603] p11 FAILED (try 3) srpm=python3-module-maturin-1.8.2-alt1.src.rpm ...

Girar awaiter (ancieg) girar-builder at altlinux.org
Wed Mar 12 16:57:42 MSK 2025


https://git.altlinux.org/tasks/377603/logs/events.3.1.log
https://packages.altlinux.org/tasks/377603

subtask  name                            aarch64    i586  x86_64
   #300  python3-module-pytest-examples        ?  failed  failed

2025-Mar-12 13:56:39 :: task #377603 for p11 resumed by ancieg:
2025-Mar-12 13:56:39 :: message: Update ruff for P11
#100 build python3-module-maturin-1.8.2-alt1.src.rpm from sisyphus
#200 build 0.9.10-alt1 from /gears/r/ruff.git fetched at 2025-Mar-11 07:45:29 from sisyphus
#300 build 0.0.15-alt1 from /gears/p/python3-module-pytest-examples.git fetched at 2025-Mar-12 13:56:27 from sisyphus
#400 build 24.12-alt1 from /gears/p/python3-module-xsdata.git fetched at 2025-Mar-12 13:56:31 from sisyphus
2025-Mar-12 13:56:40 :: created build repo
2025-Mar-12 13:56:41 :: [i586] #100 python3-module-maturin-1.8.2-alt1.src.rpm: build start
2025-Mar-12 13:56:41 :: [x86_64] #100 python3-module-maturin-1.8.2-alt1.src.rpm: build start
2025-Mar-12 13:56:41 :: [aarch64] #100 python3-module-maturin-1.8.2-alt1.src.rpm: build start
2025-Mar-12 13:56:58 :: [i586] #100 python3-module-maturin-1.8.2-alt1.src.rpm: build OK (cached)
2025-Mar-12 13:56:59 :: [i586] #200 ruff.git 0.9.10-alt1: build start
2025-Mar-12 13:56:59 :: [x86_64] #100 python3-module-maturin-1.8.2-alt1.src.rpm: build OK (cached)
2025-Mar-12 13:56:59 :: [x86_64] #200 ruff.git 0.9.10-alt1: build start
2025-Mar-12 13:57:11 :: [i586] #200 ruff.git 0.9.10-alt1: build OK (cached)
2025-Mar-12 13:57:12 :: [i586] #300 python3-module-pytest-examples.git 0.0.15-alt1: build start
2025-Mar-12 13:57:13 :: [x86_64] #200 ruff.git 0.9.10-alt1: build OK (cached)
2025-Mar-12 13:57:13 :: [x86_64] #300 python3-module-pytest-examples.git 0.0.15-alt1: build start
2025-Mar-12 13:57:16 :: [aarch64] #100 python3-module-maturin-1.8.2-alt1.src.rpm: build OK (cached)
2025-Mar-12 13:57:16 :: [aarch64] #200 ruff.git 0.9.10-alt1: build start
[i586]             '+x·=·[1,·2,·3]',
[i586] E       AssertionError: assert ['black faile...·=·[1,·2,·3]'] == ['black faile...,·2,·3]', ...]
[i586] E         
[i586] --
[i586] collecting ... collected 1 item
[i586] test_black_error_dot_space.py::test_find_run_examples[my_file.md:3-5] FAILED [100%]
[i586] =================================== FAILURES ===================================
[i586] --
[i586] =========================== short test summary info ============================
[i586] FAILED test_black_error_dot_space.py::test_find_run_examples[my_file.md:3-5]
[i586] ============================== 1 failed in 0.01s ===============================
[i586] --
[i586]             '+x = [1, 2, 3]',
[i586] E       AssertionError: assert ['black faile...-    1,', ...] == ['black faile...-    1,', ...]
[i586] E         
[i586] --
[i586] collecting ... collected 1 item
[i586] test_black_error_multiline.py::test_find_run_examples[my_file.md:3-9] FAILED [100%]
[i586] =================================== FAILURES ===================================
[i586] --
[i586] =========================== short test summary info ============================
[i586] FAILED test_black_error_multiline.py::test_find_run_examples[my_file.md:3-9]
[i586] ============================== 1 failed in 0.01s ===============================
[i586] --
[i586] INFO     : Command's result: FAILURE
[i586] INFO     : Command's error: Command '['sh', 'test.sh']' returned non-zero exit status 1.
2025-Mar-12 13:57:40 :: [i586] python3-module-pytest-examples.git 0.0.15-alt1: remote: build failed
2025-Mar-12 13:57:40 :: [i586] #300 python3-module-pytest-examples.git 0.0.15-alt1: build FAILED
2025-Mar-12 13:57:40 :: [i586] requesting cancellation of task processing
2025-Mar-12 13:57:41 :: [aarch64] #200 ruff.git 0.9.10-alt1: build OK (cached)
2025-Mar-12 13:57:41 :: [aarch64] task processing CANCELLED
[x86_64]             '+x·=·[1,·2,·3]',
[x86_64] E       AssertionError: assert ['black faile...·=·[1,·2,·3]'] == ['black faile...,·2,·3]', ...]
[x86_64] E         
[x86_64] --
[x86_64] collecting ... collected 1 item
[x86_64] test_black_error_dot_space.py::test_find_run_examples[my_file.md:3-5] FAILED [100%]
[x86_64] =================================== FAILURES ===================================
[x86_64] --
[x86_64] =========================== short test summary info ============================
[x86_64] FAILED test_black_error_dot_space.py::test_find_run_examples[my_file.md:3-5]
[x86_64] ============================== 1 failed in 0.01s ===============================
[x86_64] --
[x86_64]             '+x = [1, 2, 3]',
[x86_64] E       AssertionError: assert ['black faile...-    1,', ...] == ['black faile...-    1,', ...]
[x86_64] E         
[x86_64] --
[x86_64] collecting ... collected 1 item
[x86_64] test_black_error_multiline.py::test_find_run_examples[my_file.md:3-9] FAILED [100%]
[x86_64] =================================== FAILURES ===================================
[x86_64] --
[x86_64] =========================== short test summary info ============================
[x86_64] FAILED test_black_error_multiline.py::test_find_run_examples[my_file.md:3-9]
[x86_64] ============================== 1 failed in 0.01s ===============================
[x86_64] --
[x86_64] INFO     : Command's result: FAILURE
[x86_64] INFO     : Command's error: Command '['sh', 'test.sh']' returned non-zero exit status 1.
2025-Mar-12 13:57:41 :: [x86_64] python3-module-pytest-examples.git 0.0.15-alt1: remote: build failed
2025-Mar-12 13:57:41 :: [x86_64] #300 python3-module-pytest-examples.git 0.0.15-alt1: build FAILED
2025-Mar-12 13:57:40 :: [i586] build FAILED
2025-Mar-12 13:57:41 :: [aarch64] build FAILED
2025-Mar-12 13:57:41 :: [x86_64] build FAILED
2025-Mar-12 13:57:41 :: task #377603 for p11 FAILED


More information about the Sisyphus-incominger mailing list