[#377705] [test-only] p10 FAILED (try 3) cmrc.git=2.0.1-alt1 libfmt.git=10.2.1-alt1 ...

Girar awaiter (alton) girar-builder at altlinux.org
Wed Mar 12 11:00:56 MSK 2025


https://git.altlinux.org/tasks/377705/logs/events.3.1.log
https://packages.altlinux.org/tasks/377705

subtask  name                aarch64  armh    i586  x86_64
   #200  alterator-usbmount        ?     ?  failed  failed

2025-Mar-12 07:59:28 :: test-only task #377705 for p10 resumed by alton:
2025-Mar-12 07:59:28 :: message: new_package
#20 build 2.0.1-alt1 from /gears/c/cmrc.git fetched at 2025-Mar-12 07:19:29 from p11
#30 build 10.2.1-alt1 from /gears/l/libfmt.git fetched at 2025-Mar-12 07:23:32 from p11
#40 build 2023.09.15-alt1 from /gears/v/vcpkg.git fetched at 2025-Mar-12 07:17:49 from p11
#100 build 1.3.7-alt0.p10.1 from /people/alton/packages/rustdesk.git fetched at 2025-Mar-12 07:16:33
#200 build 0.1-alt2 from /gears/a/alterator-usbmount.git fetched at 2025-Mar-12 07:56:41 from p10
#300 build 3.0.16-alt1 from /gears/b/bear.git fetched at 2025-Mar-12 07:56:48 from p10
#400 build 0.99.55-alt1 from /gears/c/cherrytree.git fetched at 2025-Mar-12 07:56:55 from p10
#500 build 5.0.19870-alt0.p10.1 from /gears/d/dolphin-emu.git fetched at 2025-Mar-12 07:57:04 from p10
#600 build 1.8.1-alt1 from /gears/g/gerbera.git fetched at 2025-Mar-12 07:57:11 from p10
#700 build 20230922-alt4 from /gears/j/jami.git fetched at 2025-Mar-12 07:57:22 from p10
#1000 build kodi-19.5-alt2 from /gears/k/kodi.git fetched at 2025-Mar-12 07:57:31 from p10
#1100 build mangohud-0.6.9-alt1.src.rpm from p10
#1200 build 74.0.0-alt1.1 from /gears/m/mkvtoolnix.git fetched at 2025-Mar-12 07:57:51 from p10
#1300 build v0.8.1-alt1 from /gears/n/nheko.git fetched at 2025-Mar-12 07:58:00 from p10
#1400 build 0.2-alt2 from /gears/p/pdfcsp.git fetched at 2025-Mar-12 07:58:11 from p10
#1500 build 1.9.2-alt1 from /gears/s/spdlog.git fetched at 2025-Mar-12 07:58:19 from p10
#1600 build 0.9.8-alt1 from /gears/w/waybar.git fetched at 2025-Mar-12 07:58:27 from p10
#1700 build 1040-alt1 from /gears/y/yuzu.git fetched at 2025-Mar-12 07:58:39 from p10
2025-Mar-12 07:59:29 :: created build repo
2025-Mar-12 07:59:30 :: [i586] #20 cmrc.git 2.0.1-alt1: build start
2025-Mar-12 07:59:30 :: [x86_64] #20 cmrc.git 2.0.1-alt1: build start
2025-Mar-12 07:59:30 :: [armh] #20 cmrc.git 2.0.1-alt1: build start
2025-Mar-12 07:59:30 :: [aarch64] #20 cmrc.git 2.0.1-alt1: build start
2025-Mar-12 07:59:41 :: [i586] #20 cmrc.git 2.0.1-alt1: build OK (cached)
2025-Mar-12 07:59:41 :: [i586] #30 libfmt.git 10.2.1-alt1: build start
2025-Mar-12 07:59:42 :: [x86_64] #20 cmrc.git 2.0.1-alt1: build OK (cached)
2025-Mar-12 07:59:42 :: [x86_64] #30 libfmt.git 10.2.1-alt1: build start
2025-Mar-12 07:59:50 :: [aarch64] #20 cmrc.git 2.0.1-alt1: build OK (cached)
2025-Mar-12 07:59:51 :: [aarch64] #30 libfmt.git 10.2.1-alt1: build start
2025-Mar-12 07:59:52 :: [i586] #30 libfmt.git 10.2.1-alt1: build OK (cached)
2025-Mar-12 07:59:53 :: [i586] #40 vcpkg.git 2023.09.15-alt1: build start
2025-Mar-12 07:59:53 :: [x86_64] #30 libfmt.git 10.2.1-alt1: build OK (cached)
2025-Mar-12 07:59:53 :: [x86_64] #40 vcpkg.git 2023.09.15-alt1: build start
2025-Mar-12 07:59:59 :: [armh] #20 cmrc.git 2.0.1-alt1: build OK (cached)
2025-Mar-12 07:59:59 :: [armh] #30 libfmt.git 10.2.1-alt1: build start
2025-Mar-12 08:00:04 :: [i586] #40 vcpkg.git 2023.09.15-alt1: build OK (cached)
2025-Mar-12 08:00:04 :: [i586] #100 rustdesk.git 1.3.7-alt0.p10.1: build start
2025-Mar-12 08:00:05 :: [x86_64] #40 vcpkg.git 2023.09.15-alt1: build OK (cached)
2025-Mar-12 08:00:05 :: [x86_64] #100 rustdesk.git 1.3.7-alt0.p10.1: build start
2025-Mar-12 08:00:10 :: [aarch64] #30 libfmt.git 10.2.1-alt1: build OK (cached)
2025-Mar-12 08:00:10 :: [aarch64] #40 vcpkg.git 2023.09.15-alt1: build start
2025-Mar-12 08:00:18 :: [i586] #100 rustdesk.git 1.3.7-alt0.p10.1: build SKIPPED
2025-Mar-12 08:00:18 :: [i586] #200 alterator-usbmount.git 0.1-alt2: build start
2025-Mar-12 08:00:19 :: [x86_64] #100 rustdesk.git 1.3.7-alt0.p10.1: build OK (cached)
2025-Mar-12 08:00:19 :: [x86_64] #200 alterator-usbmount.git 0.1-alt2: build start
2025-Mar-12 08:00:27 :: [armh] #30 libfmt.git 10.2.1-alt1: build OK (cached)
2025-Mar-12 08:00:27 :: [armh] #40 vcpkg.git 2023.09.15-alt1: build start
2025-Mar-12 08:00:30 :: [aarch64] #40 vcpkg.git 2023.09.15-alt1: build OK (cached)
2025-Mar-12 08:00:30 :: [aarch64] #100 rustdesk.git 1.3.7-alt0.p10.1: build start
[x86_64] /usr/include/spdlog/common.h:138:130: error: incomplete type 'spdlog::is_convertible_to_basic_format_string<const char (&)[47], wchar_t>' used in nested name specifier
[x86_64]   138 |                                                                               is_convertible_to_basic_format_string<T, wchar_t>::value>
[x86_64] --
[x86_64] /usr/src/RPM/BUILD/alterator-usbmount-0.1/daemon/dbus_methods.cpp:134:50:   required from here
[x86_64] /usr/include/spdlog/common.h:137:123: error: incomplete type 'spdlog::is_convertible_to_basic_format_string<const char (&)[28], char>' used in nested name specifier
[x86_64]   137 | struct is_convertible_to_any_format_string : std::integral_constant<bool, is_convertible_to_basic_format_string<T, char>::value ||
[x86_64] /usr/include/spdlog/common.h:138:130: error: incomplete type 'spdlog::is_convertible_to_basic_format_string<const char (&)[28], wchar_t>' used in nested name specifier
[x86_64]   138 |                                                                               is_convertible_to_basic_format_string<T, wchar_t>::value>
[x86_64] --
[x86_64] /usr/src/RPM/BUILD/alterator-usbmount-0.1/daemon/dbus_methods.cpp:137:51:   required from here
[x86_64] /usr/include/spdlog/common.h:137:123: error: incomplete type 'spdlog::is_convertible_to_basic_format_string<const char (&)[29], char>' used in nested name specifier
[x86_64]   137 | struct is_convertible_to_any_format_string : std::integral_constant<bool, is_convertible_to_basic_format_string<T, char>::value ||
[x86_64] /usr/include/spdlog/common.h:138:130: error: incomplete type 'spdlog::is_convertible_to_basic_format_string<const char (&)[29], wchar_t>' used in nested name specifier
[x86_64]   138 |                                                                               is_convertible_to_basic_format_string<T, wchar_t>::value>
[x86_64] --
[x86_64] /usr/src/RPM/BUILD/alterator-usbmount-0.1/daemon/dbus_methods.cpp:153:45:   required from here
[x86_64] /usr/include/spdlog/common.h:137:123: error: incomplete type 'spdlog::is_convertible_to_basic_format_string<const char (&)[26], char>' used in nested name specifier
[x86_64]   137 | struct is_convertible_to_any_format_string : std::integral_constant<bool, is_convertible_to_basic_format_string<T, char>::value ||
[x86_64] /usr/include/spdlog/common.h:138:130: error: incomplete type 'spdlog::is_convertible_to_basic_format_string<const char (&)[26], wchar_t>' used in nested name specifier
[x86_64]   138 |                                                                               is_convertible_to_basic_format_string<T, wchar_t>::value>
[x86_64] --
[x86_64] /usr/src/RPM/BUILD/alterator-usbmount-0.1/daemon/dbus_methods.cpp:183:43:   required from here
[x86_64] /usr/include/spdlog/common.h:137:123: error: incomplete type 'spdlog::is_convertible_to_basic_format_string<const char (&)[24], char>' used in nested name specifier
[x86_64]   137 | struct is_convertible_to_any_format_string : std::integral_constant<bool, is_convertible_to_basic_format_string<T, char>::value ||
[x86_64] /usr/include/spdlog/common.h:138:130: error: incomplete type 'spdlog::is_convertible_to_basic_format_string<const char (&)[24], wchar_t>' used in nested name specifier
[x86_64]   138 |                                                                               is_convertible_to_basic_format_string<T, wchar_t>::value>
[x86_64] --
[x86_64] /usr/src/RPM/BUILD/alterator-usbmount-0.1/daemon/dbus_methods.cpp:224:37:   required from here
[x86_64] /usr/include/spdlog/common.h:137:123: error: incomplete type 'spdlog::is_convertible_to_basic_format_string<const char (&)[18], char>' used in nested name specifier
[x86_64]   137 | struct is_convertible_to_any_format_string : std::integral_constant<bool, is_convertible_to_basic_format_string<T, char>::value ||
2025-Mar-12 08:00:43 :: [x86_64] alterator-usbmount.git 0.1-alt2: remote: build failed
2025-Mar-12 08:00:43 :: [x86_64] #200 alterator-usbmount.git 0.1-alt2: build FAILED
2025-Mar-12 08:00:43 :: [x86_64] requesting cancellation of task processing
[i586] /usr/include/spdlog/common.h:137:123: error: incomplete type 'spdlog::is_convertible_to_basic_format_string<const std::__cxx11::basic_string<char>&, char>' used in nested name specifier
[i586]   137 | struct is_convertible_to_any_format_string : std::integral_constant<bool, is_convertible_to_basic_format_string<T, char>::value ||
[i586] /usr/include/spdlog/common.h:138:130: error: incomplete type 'spdlog::is_convertible_to_basic_format_string<const std::__cxx11::basic_string<char>&, wchar_t>' used in nested name specifier
[i586]   138 |                                                                               is_convertible_to_basic_format_string<T, wchar_t>::value>
[i586] --
[i586] /usr/src/RPM/BUILD/alterator-usbmount-0.1/daemon/dbus_methods.cpp:108:54:   required from here
[i586] /usr/include/spdlog/common.h:137:123: error: incomplete type 'spdlog::is_convertible_to_basic_format_string<const char (&)[32], char>' used in nested name specifier
[i586]   137 | struct is_convertible_to_any_format_string : std::integral_constant<bool, is_convertible_to_basic_format_string<T, char>::value ||
[i586] /usr/include/spdlog/common.h:138:130: error: incomplete type 'spdlog::is_convertible_to_basic_format_string<const char (&)[32], wchar_t>' used in nested name specifier
[i586]   138 |                                                                               is_convertible_to_basic_format_string<T, wchar_t>::value>
[i586] --
[i586] /usr/src/RPM/BUILD/alterator-usbmount-0.1/daemon/dbus_methods.cpp:111:69:   required from here
[i586] /usr/include/spdlog/common.h:137:123: error: incomplete type 'spdlog::is_convertible_to_basic_format_string<const char (&)[47], char>' used in nested name specifier
[i586]   137 | struct is_convertible_to_any_format_string : std::integral_constant<bool, is_convertible_to_basic_format_string<T, char>::value ||
[i586] /usr/include/spdlog/common.h:138:130: error: incomplete type 'spdlog::is_convertible_to_basic_format_string<const char (&)[47], wchar_t>' used in nested name specifier
[i586]   138 |                                                                               is_convertible_to_basic_format_string<T, wchar_t>::value>
[i586] --
[i586] /usr/src/RPM/BUILD/alterator-usbmount-0.1/daemon/dbus_methods.cpp:134:50:   required from here
[i586] /usr/include/spdlog/common.h:137:123: error: incomplete type 'spdlog::is_convertible_to_basic_format_string<const char (&)[28], char>' used in nested name specifier
[i586]   137 | struct is_convertible_to_any_format_string : std::integral_constant<bool, is_convertible_to_basic_format_string<T, char>::value ||
[i586] /usr/include/spdlog/common.h:138:130: error: incomplete type 'spdlog::is_convertible_to_basic_format_string<const char (&)[28], wchar_t>' used in nested name specifier
[i586]   138 |                                                                               is_convertible_to_basic_format_string<T, wchar_t>::value>
[i586] --
[i586] /usr/src/RPM/BUILD/alterator-usbmount-0.1/daemon/dbus_methods.cpp:137:51:   required from here
[i586] /usr/include/spdlog/common.h:137:123: error: incomplete type 'spdlog::is_convertible_to_basic_format_string<const char (&)[29], char>' used in nested name specifier
[i586]   137 | struct is_convertible_to_any_format_string : std::integral_constant<bool, is_convertible_to_basic_format_string<T, char>::value ||
[i586] /usr/include/spdlog/common.h:138:130: error: incomplete type 'spdlog::is_convertible_to_basic_format_string<const char (&)[29], wchar_t>' used in nested name specifier
[i586]   138 |                                                                               is_convertible_to_basic_format_string<T, wchar_t>::value>
2025-Mar-12 08:00:44 :: [i586] alterator-usbmount.git 0.1-alt2: remote: build failed
2025-Mar-12 08:00:44 :: [i586] #200 alterator-usbmount.git 0.1-alt2: build FAILED
2025-Mar-12 08:00:54 :: [aarch64] #100 rustdesk.git 1.3.7-alt0.p10.1: build OK (cached)
2025-Mar-12 08:00:54 :: [aarch64] task processing CANCELLED
2025-Mar-12 08:00:56 :: [armh] #40 vcpkg.git 2023.09.15-alt1: build OK (cached)
2025-Mar-12 08:00:56 :: [armh] task processing CANCELLED
2025-Mar-12 08:00:43 :: [x86_64] build FAILED
2025-Mar-12 08:00:44 :: [i586] build FAILED
2025-Mar-12 08:00:54 :: [aarch64] build FAILED
2025-Mar-12 08:00:56 :: [armh] build FAILED
2025-Mar-12 08:00:56 :: task #377705 for p10 FAILED


More information about the Sisyphus-incominger mailing list