[#377580] [test-only] p11 FAILED (try 3) shadow.git=4.17.3-alt1 buildah.git=1.39.0-alt1 podman.git=5.4.0-alt1
Girar awaiter (sem)
girar-builder at altlinux.org
Tue Mar 11 21:57:55 MSK 2025
https://git.altlinux.org/tasks/377580/logs/events.3.1.log
https://packages.altlinux.org/tasks/377580
2025-Mar-11 18:47:36 :: test-only task #377580 for p11 resumed by sem:
2025-Mar-11 18:47:36 :: message: new_version_with_libsubid_soname_change
#100 build 4.17.3-alt1 from /people/sem/packages/shadow.git fetched at 2025-Mar-10 21:14:54
#200 build 1.39.0-alt1 from /gears/b/buildah.git fetched at 2025-Mar-11 17:38:20 from p11
#300 build 5.4.0-alt1 from /gears/p/podman.git fetched at 2025-Mar-11 17:38:38 from p11
2025-Mar-11 18:47:36 :: created build repo
2025-Mar-11 18:47:37 :: [x86_64] #100 shadow.git 4.17.3-alt1: build start
2025-Mar-11 18:47:37 :: [aarch64] #100 shadow.git 4.17.3-alt1: build start
2025-Mar-11 18:47:37 :: [i586] #100 shadow.git 4.17.3-alt1: build start
2025-Mar-11 18:47:54 :: [i586] #100 shadow.git 4.17.3-alt1: build OK (cached)
2025-Mar-11 18:47:54 :: [i586] #200 buildah.git 1.39.0-alt1: build start
2025-Mar-11 18:47:59 :: [x86_64] #100 shadow.git 4.17.3-alt1: build OK (cached)
2025-Mar-11 18:47:59 :: [x86_64] #200 buildah.git 1.39.0-alt1: build start
2025-Mar-11 18:48:11 :: [aarch64] #100 shadow.git 4.17.3-alt1: build OK (cached)
2025-Mar-11 18:48:11 :: [aarch64] #200 buildah.git 1.39.0-alt1: build start
2025-Mar-11 18:48:16 :: [i586] #200 buildah.git 1.39.0-alt1: build OK (cached)
2025-Mar-11 18:48:16 :: [i586] #300 podman.git 5.4.0-alt1: build start
2025-Mar-11 18:48:21 :: [x86_64] #200 buildah.git 1.39.0-alt1: build OK (cached)
2025-Mar-11 18:48:21 :: [x86_64] #300 podman.git 5.4.0-alt1: build start
2025-Mar-11 18:48:29 :: [i586] #300 podman.git 5.4.0-alt1: build OK (cached)
2025-Mar-11 18:48:35 :: [x86_64] #300 podman.git 5.4.0-alt1: build OK (cached)
2025-Mar-11 18:48:46 :: [aarch64] #200 buildah.git 1.39.0-alt1: build OK (cached)
2025-Mar-11 18:48:46 :: [aarch64] #300 podman.git 5.4.0-alt1: build start
2025-Mar-11 18:49:10 :: [aarch64] #300 podman.git 5.4.0-alt1: build OK (cached)
2025-Mar-11 18:50:01 :: #100: shadow.git 4.17.3-alt1: build check OK
2025-Mar-11 18:50:13 :: #200: buildah.git 1.39.0-alt1: build check OK
2025-Mar-11 18:50:35 :: #300: podman.git 5.4.0-alt1: build check OK
2025-Mar-11 18:50:36 :: build check OK
2025-Mar-11 18:51:17 :: noarch check OK
2025-Mar-11 18:51:19 :: plan: src +3 -3 =19576, aarch64 +26 -26 =33982, i586 +25 -25 =33132, noarch +2 -2 =20457, x86_64 +26 -26 =34758
#100 shadow 4.15.3-alt2 -> 1:4.17.3-alt1
Mon Mar 10 2025 Mikhail Efremov <sem at altlinux> 1:4.17.3-alt1
- Dropped PAM config for chage.
- chpasswd,newusers: Fixed printf() format.
- lib: Fixed variable type in strrspn() and strrcspn().
- Updated to 4.17.3.
Thu Feb 06 2025 Mikhail Efremov <sem at altlinux> 1:4.17.2-alt1
- Returned Basename() function.
- Dropped unused variables.
- Updated to 4.17.2.
Thu Aug 08 2024 Mikhail Efremov <sem at altlinux> 1:4.16.0-alt2
[...]
2025-Mar-11 18:51:20 :: shadow: closes bugs: 51106
2025-Mar-11 18:51:58 :: patched apt indices
2025-Mar-11 18:52:08 :: created next repo
2025-Mar-11 18:52:18 :: duplicate provides check OK
2025-Mar-11 18:52:55 :: dependencies check OK
2025-Mar-11 18:53:21 :: [x86_64 i586 aarch64] ELF symbols check OK
2025-Mar-11 18:53:35 :: [i586] #200 buildah: install check OK (cached)
2025-Mar-11 18:53:35 :: [x86_64] #200 buildah: install check OK (cached)
2025-Mar-11 18:53:39 :: [i586] #200 buildah-debuginfo: install check OK (cached)
2025-Mar-11 18:53:40 :: [x86_64] #200 buildah-debuginfo: install check OK (cached)
2025-Mar-11 18:53:43 :: [i586] #100 libsubid-devel: install check OK (cached)
2025-Mar-11 18:53:44 :: [x86_64] #100 libsubid-devel: install check OK (cached)
2025-Mar-11 18:53:45 :: [aarch64] #200 buildah: install check OK (cached)
2025-Mar-11 18:53:47 :: [i586] #100 libsubid5: install check OK (cached)
2025-Mar-11 18:53:48 :: [x86_64] #100 libsubid5: install check OK (cached)
2025-Mar-11 18:53:51 :: [i586] #100 libsubid5-debuginfo: install check OK (cached)
2025-Mar-11 18:53:52 :: [aarch64] #200 buildah-debuginfo: install check OK (cached)
2025-Mar-11 18:53:53 :: [x86_64] #100 libsubid5-debuginfo: install check OK (cached)
i586: podman=5.4.0-alt1 post-install unowned files:
/usr/lib/systemd/system-generators
/usr/lib/systemd/user
/usr/lib/systemd/user-generators
/usr/share/fish
/usr/share/fish/vendor_completions.d
/usr/share/zsh
/usr/share/zsh/site-functions
2025-Mar-11 18:53:55 :: [i586] #300 podman: install check OK (cached)
x86_64: podman=5.4.0-alt1 post-install unowned files:
/usr/lib/systemd/system-generators
/usr/lib/systemd/user
/usr/lib/systemd/user-generators
/usr/share/fish
/usr/share/fish/vendor_completions.d
/usr/share/zsh
/usr/share/zsh/site-functions
2025-Mar-11 18:53:58 :: [x86_64] #300 podman: install check OK (cached)
2025-Mar-11 18:54:00 :: [aarch64] #100 libsubid-devel: install check OK (cached)
2025-Mar-11 18:54:00 :: [i586] #300 podman-debuginfo: install check OK (cached)
i586: podman-docker=5.4.0-alt1 post-install unowned files:
/usr/share/user-tmpfiles.d
2025-Mar-11 18:54:04 :: [i586] #300 podman-docker: install check OK (cached)
2025-Mar-11 18:54:05 :: [x86_64] #300 podman-debuginfo: install check OK (cached)
2025-Mar-11 18:54:07 :: [aarch64] #100 libsubid5: install check OK (cached)
2025-Mar-11 18:54:08 :: [i586] #300 podman-remote: install check OK (cached)
x86_64: podman-docker=5.4.0-alt1 post-install unowned files:
/usr/share/user-tmpfiles.d
2025-Mar-11 18:54:09 :: [x86_64] #300 podman-docker: install check OK (cached)
2025-Mar-11 18:54:12 :: [i586] #300 podman-remote-debuginfo: install check OK (cached)
2025-Mar-11 18:54:14 :: [x86_64] #300 podman-machine: install check OK (cached)
2025-Mar-11 18:54:14 :: [aarch64] #100 libsubid5-debuginfo: install check OK (cached)
2025-Mar-11 18:54:16 :: [i586] #100 shadow-change: install check OK (cached)
2025-Mar-11 18:54:18 :: [x86_64] #300 podman-remote: install check OK (cached)
2025-Mar-11 18:54:20 :: [i586] #100 shadow-change-debuginfo: install check OK (cached)
aarch64: podman=5.4.0-alt1 post-install unowned files:
/usr/lib/systemd/system-generators
/usr/lib/systemd/user
/usr/lib/systemd/user-generators
/usr/share/fish
/usr/share/fish/vendor_completions.d
/usr/share/zsh
/usr/share/zsh/site-functions
2025-Mar-11 18:54:22 :: [aarch64] #300 podman: install check OK (cached)
2025-Mar-11 18:54:23 :: [x86_64] #300 podman-remote-debuginfo: install check OK (cached)
2025-Mar-11 18:54:24 :: [i586] #100 shadow-check: install check OK (cached)
2025-Mar-11 18:54:27 :: [x86_64] #100 shadow-change: install check OK (cached)
2025-Mar-11 18:54:28 :: [i586] #100 shadow-check-debuginfo: install check OK (cached)
2025-Mar-11 18:54:30 :: [aarch64] #300 podman-debuginfo: install check OK (cached)
2025-Mar-11 18:54:30 :: [i586] #100 shadow-convert: install check OK (basesystem)
2025-Mar-11 18:54:31 :: [x86_64] #100 shadow-change-debuginfo: install check OK (cached)
2025-Mar-11 18:54:34 :: [i586] #100 shadow-convert-debuginfo: install check OK (cached)
2025-Mar-11 18:54:36 :: [x86_64] #100 shadow-check: install check OK (cached)
aarch64: podman-docker=5.4.0-alt1 post-install unowned files:
/usr/share/user-tmpfiles.d
2025-Mar-11 18:54:37 :: [aarch64] #300 podman-docker: install check OK (cached)
2025-Mar-11 18:54:38 :: [i586] #100 shadow-edit: install check OK (cached)
2025-Mar-11 18:54:40 :: [x86_64] #100 shadow-check-debuginfo: install check OK (cached)
2025-Mar-11 18:54:41 :: [x86_64] #100 shadow-convert: install check OK (basesystem)
2025-Mar-11 18:54:42 :: [i586] #100 shadow-edit-debuginfo: install check OK (cached)
2025-Mar-11 18:54:46 :: [aarch64] #300 podman-machine: install check OK (cached)
2025-Mar-11 18:54:46 :: [x86_64] #100 shadow-convert-debuginfo: install check OK (cached)
2025-Mar-11 18:54:46 :: [i586] #100 shadow-groups: install check OK (cached)
2025-Mar-11 18:54:50 :: [i586] #100 shadow-groups-debuginfo: install check OK (cached)
2025-Mar-11 18:54:50 :: [x86_64] #100 shadow-edit: install check OK (cached)
2025-Mar-11 18:54:53 :: [aarch64] #300 podman-remote: install check OK (cached)
2025-Mar-11 18:54:54 :: [i586] #100 shadow-log: install check OK (cached)
2025-Mar-11 18:54:54 :: [x86_64] #100 shadow-edit-debuginfo: install check OK (cached)
2025-Mar-11 18:54:58 :: [i586] #100 shadow-log-debuginfo: install check OK (cached)
2025-Mar-11 18:54:58 :: [x86_64] #100 shadow-groups: install check OK (cached)
2025-Mar-11 18:55:01 :: [aarch64] #300 podman-remote-debuginfo: install check OK (cached)
2025-Mar-11 18:55:02 :: [i586] #100 shadow-submap: install check OK (cached)
2025-Mar-11 18:55:03 :: [x86_64] #100 shadow-groups-debuginfo: install check OK (cached)
2025-Mar-11 18:55:06 :: [i586] #100 shadow-submap-debuginfo: install check OK (cached)
2025-Mar-11 18:55:07 :: [x86_64] #100 shadow-log: install check OK (cached)
2025-Mar-11 18:55:09 :: [aarch64] #100 shadow-change: install check OK (cached)
2025-Mar-11 18:55:10 :: [i586] #100 shadow-suite: install check OK (cached)
2025-Mar-11 18:55:11 :: [x86_64] #100 shadow-log-debuginfo: install check OK (cached)
2025-Mar-11 18:55:11 :: [i586] #100 shadow-utils: install check OK (basesystem)
2025-Mar-11 18:55:15 :: [x86_64] #100 shadow-submap: install check OK (cached)
2025-Mar-11 18:55:15 :: [i586] #100 shadow-utils-debuginfo: install check OK (cached)
2025-Mar-11 18:55:16 :: [aarch64] #100 shadow-change-debuginfo: install check OK (cached)
2025-Mar-11 18:55:19 :: [x86_64] #100 shadow-submap-debuginfo: install check OK (cached)
2025-Mar-11 18:55:23 :: [aarch64] #100 shadow-check: install check OK (cached)
2025-Mar-11 18:55:24 :: [x86_64] #100 shadow-suite: install check OK (cached)
2025-Mar-11 18:55:25 :: [x86_64] #100 shadow-utils: install check OK (basesystem)
2025-Mar-11 18:55:29 :: [x86_64] #100 shadow-utils-debuginfo: install check OK (cached)
2025-Mar-11 18:55:31 :: [aarch64] #100 shadow-check-debuginfo: install check OK (cached)
2025-Mar-11 18:55:33 :: [aarch64] #100 shadow-convert: install check OK (basesystem)
2025-Mar-11 18:55:40 :: [aarch64] #100 shadow-convert-debuginfo: install check OK (cached)
2025-Mar-11 18:55:47 :: [aarch64] #100 shadow-edit: install check OK (cached)
2025-Mar-11 18:55:55 :: [aarch64] #100 shadow-edit-debuginfo: install check OK (cached)
2025-Mar-11 18:56:02 :: [aarch64] #100 shadow-groups: install check OK (cached)
2025-Mar-11 18:56:10 :: [aarch64] #100 shadow-groups-debuginfo: install check OK (cached)
2025-Mar-11 18:56:17 :: [aarch64] #100 shadow-log: install check OK (cached)
2025-Mar-11 18:56:24 :: [aarch64] #100 shadow-log-debuginfo: install check OK (cached)
2025-Mar-11 18:56:32 :: [aarch64] #100 shadow-submap: install check OK (cached)
2025-Mar-11 18:56:39 :: [aarch64] #100 shadow-submap-debuginfo: install check OK (cached)
2025-Mar-11 18:56:47 :: [aarch64] #100 shadow-suite: install check OK (cached)
2025-Mar-11 18:56:49 :: [aarch64] #100 shadow-utils: install check OK (basesystem)
2025-Mar-11 18:56:56 :: [aarch64] #100 shadow-utils-debuginfo: install check OK (cached)
2025-Mar-11 18:56:58 :: [x86_64-i586] plan: #2 +2 -2 =11410
2025-Mar-11 18:57:26 :: [x86_64-i586] arepo build OK
2025-Mar-11 18:57:41 :: [x86_64-i586] generated apt indices
2025-Mar-11 18:57:43 :: [x86_64-i586] created next repo
2025-Mar-11 18:57:53 :: [x86_64-i586] dependencies check OK
warning: #100: shadow.git tag `4.17.3-alt1' is not inherited from /gears/s/shadow.git branch `p11' (relaxed by sem)
2025-Mar-11 18:57:55 :: gears inheritance check COND-OK for: #100
error: #100: shadow-4.17.3-alt1.src.rpm: missing last changelog entry from shadow-4.15.3-alt2.src.rpm:
* Thu Aug 08 2024 sem at altlinux 1:4.15.3-alt2
2025-Mar-11 18:57:55 :: srpm inheritance check FAILED for: #100
2025-Mar-11 18:57:55 :: task #377580 for p11 FAILED
More information about the Sisyphus-incominger
mailing list