[#377638] [test-only] FAILED grafana.git=11.5.2-alt1
Girar awaiter (writers)
girar-builder at altlinux.org
Tue Mar 11 14:27:56 MSK 2025
https://git.altlinux.org/tasks/377638/logs/events.1.1.log
https://packages.altlinux.org/tasks/377638
subtask name aarch64 i586 x86_64
#100 grafana failed failed 6:36
2025-Mar-11 11:21:17 :: test-only task #377638 for sisyphus started by writers:
#100 build 11.5.2-alt1 from /people/writers/packages/grafana.git fetched at 2025-Mar-11 11:20:41
2025-Mar-11 11:21:19 :: [i586] #100 grafana.git 11.5.2-alt1: build start
2025-Mar-11 11:21:19 :: [x86_64] #100 grafana.git 11.5.2-alt1: build start
2025-Mar-11 11:21:19 :: [aarch64] #100 grafana.git 11.5.2-alt1: build start
[aarch64] NX (0 , native_1.connectToNxDb) is not a function
[aarch64] TypeError: (0 , native_1.connectToNxDb) is not a function
[aarch64] at /usr/src/RPM/BUILD/grafana-11.5.2/node_modules/nx/src/utils/db-connection.js:11:93
[aarch64] --
[aarch64] at process.processTicksAndRejections (node:internal/process/task_queues:105:5)
[aarch64] Error: Command failed: yarn nx run grafana:\"build\"
[aarch64] at genericNodeError (node:internal/errors:983:15)
2025-Mar-11 11:24:46 :: [aarch64] grafana.git 11.5.2-alt1: remote: build failed
2025-Mar-11 11:24:46 :: [aarch64] #100 grafana.git 11.5.2-alt1: build FAILED
2025-Mar-11 11:24:46 :: [aarch64] requesting cancellation of task processing
[i586] NX (0 , native_1.connectToNxDb) is not a function
[i586] TypeError: (0 , native_1.connectToNxDb) is not a function
[i586] at /usr/src/RPM/BUILD/grafana-11.5.2/node_modules/nx/src/utils/db-connection.js:11:93
[i586] --
[i586] at process.processTicksAndRejections (node:internal/process/task_queues:105:5)
[i586] Error: Command failed: yarn nx run grafana:\"build\"
[i586] at genericNodeError (node:internal/errors:983:15)
2025-Mar-11 11:25:03 :: [i586] grafana.git 11.5.2-alt1: remote: build failed
2025-Mar-11 11:25:04 :: [i586] #100 grafana.git 11.5.2-alt1: build FAILED
2025-Mar-11 11:27:55 :: [x86_64] #100 grafana.git 11.5.2-alt1: build OK
2025-Mar-11 11:24:47 :: [aarch64] build FAILED
2025-Mar-11 11:25:04 :: [i586] build FAILED
2025-Mar-11 11:27:56 :: task #377638 for sisyphus FAILED
More information about the Sisyphus-incominger
mailing list