[#377439] FAILED (try 5) rpm-build-haskell.git=1.5.2-alt1 ghc.git=9.2.8-alt1 ...
Girar awaiter (respublica)
girar-builder at altlinux.org
Mon Mar 10 16:59:37 MSK 2025
https://git.altlinux.org/tasks/377439/logs/events.5.1.log
https://packages.altlinux.org/tasks/377439
subtask name aarch64 i586 x86_64
#600 ghc9.2 failed failed failed
2025-Mar-10 12:52:40 :: task #377439 for sisyphus resumed by respublica:
#40 removed
#60 build 1.5.2-alt1 from /people/respublica/packages/rpm-build-haskell.git fetched at 2025-Mar-09 16:11:40
#100 removed
#140 removed
#160 build 9.2.8-alt1 from /people/respublica/packages/ghc.git fetched at 2025-Mar-10 10:32:26
#200 build 1.20.1.1-alt1 from /people/respublica/packages/happy.git fetched at 2025-Mar-09 16:00:37
#300 build 3.5.2.0-alt1 from /people/respublica/packages/alex.git fetched at 2025-Mar-09 16:01:28
#400 removed
#500 removed
#600 build 9.2.8-alt2 from /people/respublica/packages/ghc9.2.git fetched at 2025-Mar-10 12:52:10
2025-Mar-10 12:52:41 :: created build repo
2025-Mar-10 12:52:42 :: [i586] #60 rpm-build-haskell.git 1.5.2-alt1: build start
2025-Mar-10 12:52:42 :: [x86_64] #60 rpm-build-haskell.git 1.5.2-alt1: build start
2025-Mar-10 12:52:42 :: [aarch64] #60 rpm-build-haskell.git 1.5.2-alt1: build start
2025-Mar-10 12:53:00 :: [i586] #60 rpm-build-haskell.git 1.5.2-alt1: build OK (cached)
2025-Mar-10 12:53:00 :: [i586] #160 ghc.git 9.2.8-alt1: build start
2025-Mar-10 12:53:01 :: [x86_64] #60 rpm-build-haskell.git 1.5.2-alt1: build OK (cached)
2025-Mar-10 12:53:01 :: [x86_64] #160 ghc.git 9.2.8-alt1: build start
2025-Mar-10 12:53:12 :: [i586] #160 ghc.git 9.2.8-alt1: build OK (cached)
2025-Mar-10 12:53:13 :: [i586] #200 happy.git 1.20.1.1-alt1: build start
2025-Mar-10 12:53:15 :: [x86_64] #160 ghc.git 9.2.8-alt1: build OK (cached)
2025-Mar-10 12:53:15 :: [x86_64] #200 happy.git 1.20.1.1-alt1: build start
2025-Mar-10 12:53:18 :: [aarch64] #60 rpm-build-haskell.git 1.5.2-alt1: build OK (cached)
2025-Mar-10 12:53:18 :: [aarch64] #160 ghc.git 9.2.8-alt1: build start
2025-Mar-10 12:53:26 :: [i586] #200 happy.git 1.20.1.1-alt1: build OK (cached)
2025-Mar-10 12:53:26 :: [i586] #300 alex.git 3.5.2.0-alt1: build start
2025-Mar-10 12:53:29 :: [x86_64] #200 happy.git 1.20.1.1-alt1: build OK (cached)
2025-Mar-10 12:53:29 :: [x86_64] #300 alex.git 3.5.2.0-alt1: build start
2025-Mar-10 12:53:39 :: [i586] #300 alex.git 3.5.2.0-alt1: build OK (cached)
2025-Mar-10 12:53:39 :: [i586] #600 ghc9.2.git 9.2.8-alt2: build start
2025-Mar-10 12:53:43 :: [aarch64] #160 ghc.git 9.2.8-alt1: build OK (cached)
2025-Mar-10 12:53:43 :: [x86_64] #300 alex.git 3.5.2.0-alt1: build OK (cached)
2025-Mar-10 12:53:43 :: [aarch64] #200 happy.git 1.20.1.1-alt1: build start
2025-Mar-10 12:53:43 :: [x86_64] #600 ghc9.2.git 9.2.8-alt2: build start
2025-Mar-10 12:54:09 :: [aarch64] #200 happy.git 1.20.1.1-alt1: build OK (cached)
2025-Mar-10 12:54:09 :: [aarch64] #300 alex.git 3.5.2.0-alt1: build start
2025-Mar-10 12:54:35 :: [aarch64] #300 alex.git 3.5.2.0-alt1: build OK (cached)
2025-Mar-10 12:54:35 :: [aarch64] #600 ghc9.2.git 9.2.8-alt2: build start
[i586] verify-elf: ERROR: ./usr/lib/ghc-9.2.8/lib/i386-linux-ghc-9.2.8/libHSrts-1.0.2_thr_l-ghc9.2.8.so: undefined symbol: ghczmprim_GHCziPrimziException_raiseDivZZero_closure
[i586] verify-elf: ERROR: ./usr/lib/ghc-9.2.8/lib/i386-linux-ghc-9.2.8/libHSrts-1.0.2_thr_l-ghc9.2.8.so: undefined symbol: base_GHCziIOziException_blockedIndefinitelyOnMVar_closure
[i586] verify-elf: ERROR: ./usr/lib/ghc-9.2.8/lib/i386-linux-ghc-9.2.8/libHSrts-1.0.2_thr_l-ghc9.2.8.so: undefined symbol: base_GHCziInt_I8zh_con_info
[i586] verify-elf: ERROR: ./usr/lib/ghc-9.2.8/lib/i386-linux-ghc-9.2.8/libHSrts-1.0.2_thr_l-ghc9.2.8.so: undefined symbol: base_GHCziEventziThread_blockedOnBadFD_closure
[i586] verify-elf: ERROR: ./usr/lib/ghc-9.2.8/lib/i386-linux-ghc-9.2.8/libHSrts-1.0.2_thr_l-ghc9.2.8.so: undefined symbol: base_GHCziIOziException_cannotCompactFunction_closure
[i586] verify-elf: ERROR: ./usr/lib/ghc-9.2.8/lib/i386-linux-ghc-9.2.8/libHSrts-1.0.2_thr_l-ghc9.2.8.so: undefined symbol: base_GHCziConcziSignal_runHandlersPtr_closure
[i586] verify-elf: ERROR: ./usr/lib/ghc-9.2.8/lib/i386-linux-ghc-9.2.8/libHSrts-1.0.2_thr_l-ghc9.2.8.so: undefined symbol: base_GHCziIOPort_doubleReadException_closure
[i586] verify-elf: ERROR: ./usr/lib/ghc-9.2.8/lib/i386-linux-ghc-9.2.8/libHSrts-1.0.2_thr_l-ghc9.2.8.so: undefined symbol: base_GHCziInt_I64zh_con_info
[i586] verify-elf: ERROR: ./usr/lib/ghc-9.2.8/lib/i386-linux-ghc-9.2.8/libHSrts-1.0.2_thr_l-ghc9.2.8.so: undefined symbol: base_GHCziTopHandler_runNonIO_closure
[i586] verify-elf: ERROR: ./usr/lib/ghc-9.2.8/lib/i386-linux-ghc-9.2.8/libHSrts-1.0.2_thr_l-ghc9.2.8.so: undefined symbol: ghczmprim_GHCziTypes_Wzh_con_info
[i586] verify-elf: ERROR: ./usr/lib/ghc-9.2.8/lib/i386-linux-ghc-9.2.8/libHSrts-1.0.2_thr_l-ghc9.2.8.so: undefined symbol: base_GHCziIOziException_allocationLimitExceeded_closure
2025-Mar-10 13:21:04 :: [i586] ghc9.2.git 9.2.8-alt2: remote: build failed
2025-Mar-10 13:21:04 :: [i586] #600 ghc9.2.git 9.2.8-alt2: build FAILED
2025-Mar-10 13:21:04 :: [i586] requesting cancellation of task processing
[x86_64] verify-elf: ERROR: ./usr/lib64/ghc-9.2.8/lib/x86_64-linux-ghc-9.2.8/libHSrts-1.0.2_l-ghc9.2.8.so: undefined symbol: ghczmprim_GHCziTypes_Dzh_con_info
[x86_64] verify-elf: ERROR: ./usr/lib64/ghc-9.2.8/lib/x86_64-linux-ghc-9.2.8/libHSrts-1.0.2_l-ghc9.2.8.so: undefined symbol: base_GHCziConcziSync_runSparks_closure
[x86_64] verify-elf: ERROR: ./usr/lib64/ghc-9.2.8/lib/x86_64-linux-ghc-9.2.8/libHSrts-1.0.2_l-ghc9.2.8.so: undefined symbol: base_GHCziStable_StablePtr_con_info
[x86_64] verify-elf: ERROR: ./usr/lib64/ghc-9.2.8/lib/x86_64-linux-ghc-9.2.8/libHSrts-1.0.2_l-ghc9.2.8.so: undefined symbol: ghczmprim_GHCziTypes_Czh_con_info
[x86_64] verify-elf: ERROR: ./usr/lib64/ghc-9.2.8/lib/x86_64-linux-ghc-9.2.8/libHSrts-1.0.2_l-ghc9.2.8.so: undefined symbol: base_GHCziExceptionziType_overflowException_closure
[x86_64] verify-elf: ERROR: ./usr/lib64/ghc-9.2.8/lib/x86_64-linux-ghc-9.2.8/libHSrts-1.0.2_l-ghc9.2.8.so: undefined symbol: ghczmprim_GHCziPrimziPanic_absentSumFieldError_closure
[x86_64] verify-elf: ERROR: ./usr/lib64/ghc-9.2.8/lib/x86_64-linux-ghc-9.2.8/libHSrts-1.0.2_l-ghc9.2.8.so: undefined symbol: base_GHCziPtr_FunPtr_con_info
[x86_64] verify-elf: ERROR: ./usr/lib64/ghc-9.2.8/lib/x86_64-linux-ghc-9.2.8/libHSrts-1.0.2_l-ghc9.2.8.so: undefined symbol: base_GHCziIOziException_cannotCompactPinned_closure
[x86_64] verify-elf: ERROR: ./usr/lib64/ghc-9.2.8/lib/x86_64-linux-ghc-9.2.8/libHSrts-1.0.2_l-ghc9.2.8.so: undefined symbol: base_GHCziWord_W64zh_con_info
[x86_64] verify-elf: ERROR: ./usr/lib64/ghc-9.2.8/lib/x86_64-linux-ghc-9.2.8/libHSrts-1.0.2_l-ghc9.2.8.so: undefined symbol: base_GHCziExceptionziType_divZZeroException_closure
[x86_64] verify-elf: ERROR: ./usr/lib64/ghc-9.2.8/lib/x86_64-linux-ghc-9.2.8/libHSrts-1.0.2_l-ghc9.2.8.so: undefined symbol: base_GHCziIOziException_cannotCompactMutable_closure
2025-Mar-10 13:23:33 :: [x86_64] ghc9.2.git 9.2.8-alt2: remote: build failed
2025-Mar-10 13:23:33 :: [x86_64] #600 ghc9.2.git 9.2.8-alt2: build FAILED
[aarch64] verify-elf: ERROR: ./usr/lib64/ghc-9.2.8/lib/aarch64-linux-ghc-9.2.8/libHSrts-1.0.2_l-ghc9.2.8.so: undefined symbol: base_GHCziWord_W64zh_con_info
[aarch64] verify-elf: ERROR: ./usr/lib64/ghc-9.2.8/lib/aarch64-linux-ghc-9.2.8/libHSrts-1.0.2_l-ghc9.2.8.so: undefined symbol: base_GHCziExceptionziType_divZZeroException_closure
[aarch64] verify-elf: ERROR: ./usr/lib64/ghc-9.2.8/lib/aarch64-linux-ghc-9.2.8/libHSrts-1.0.2_l-ghc9.2.8.so: undefined symbol: base_GHCziIOziException_cannotCompactMutable_closure
[aarch64] verify-elf: ERROR: ./usr/lib64/ghc-9.2.8/lib/aarch64-linux-ghc-9.2.8/libHSrts-1.0.2_l-ghc9.2.8.so: undefined symbol: base_GHCziTopHandler_runIO_closure
[aarch64] verify-elf: ERROR: ./usr/lib64/ghc-9.2.8/lib/aarch64-linux-ghc-9.2.8/libHSrts-1.0.2_l-ghc9.2.8.so: undefined symbol: base_GHCziInt_I32zh_con_info
[aarch64] verify-elf: ERROR: ./usr/lib64/ghc-9.2.8/lib/aarch64-linux-ghc-9.2.8/libHSrts-1.0.2_l-ghc9.2.8.so: undefined symbol: base_GHCziIOziException_blockedIndefinitelyOnSTM_closure
[aarch64] verify-elf: ERROR: ./usr/lib64/ghc-9.2.8/lib/aarch64-linux-ghc-9.2.8/libHSrts-1.0.2_l-ghc9.2.8.so: undefined symbol: hs_cmpxchg64
[aarch64] verify-elf: WARNING: ./usr/lib64/ghc-9.2.8/lib/aarch64-linux-ghc-9.2.8/libHSrts-1.0.2_thr_l-ghc9.2.8.so: skipping eu-elflint by request
[aarch64] verify-elf: WARNING: ./usr/lib64/ghc-9.2.8/lib/aarch64-linux-ghc-9.2.8/libHSrts-1.0.2_thr_l-ghc9.2.8.so: RPATH entry found: $ORIGIN
[aarch64] verify-elf: ERROR: ./usr/lib64/ghc-9.2.8/lib/aarch64-linux-ghc-9.2.8/libHSrts-1.0.2_thr_l-ghc9.2.8.so: undefined symbol: ghczmprim_GHCziTypes_False_closure
[aarch64] verify-elf: ERROR: ./usr/lib64/ghc-9.2.8/lib/aarch64-linux-ghc-9.2.8/libHSrts-1.0.2_thr_l-ghc9.2.8.so: undefined symbol: ghczmprim_GHCziPrimziException_raiseDivZZero_closure
[aarch64] verify-elf: ERROR: ./usr/lib64/ghc-9.2.8/lib/aarch64-linux-ghc-9.2.8/libHSrts-1.0.2_thr_l-ghc9.2.8.so: undefined symbol: base_GHCziIOziException_blockedIndefinitelyOnMVar_closure
[aarch64] verify-elf: ERROR: ./usr/lib64/ghc-9.2.8/lib/aarch64-linux-ghc-9.2.8/libHSrts-1.0.2_thr_l-ghc9.2.8.so: undefined symbol: base_GHCziInt_I8zh_con_info
2025-Mar-10 13:59:37 :: [aarch64] ghc9.2.git 9.2.8-alt2: remote: build failed
2025-Mar-10 13:59:37 :: [aarch64] #600 ghc9.2.git 9.2.8-alt2: build FAILED
2025-Mar-10 13:21:04 :: [i586] build FAILED
2025-Mar-10 13:23:33 :: [x86_64] build FAILED
2025-Mar-10 13:59:37 :: [aarch64] build FAILED
2025-Mar-10 13:59:37 :: task #377439 for sisyphus FAILED
More information about the Sisyphus-incominger
mailing list