[#377422] [test-only] FAILED gperftools.git=2.16.90-alt1

Girar awaiter (vt) girar-builder at altlinux.org
Sun Mar 9 10:11:08 MSK 2025


https://git.altlinux.org/tasks/377422/logs/events.1.1.log
https://packages.altlinux.org/tasks/377422

subtask  name        aarch64    i586  x86_64
   #100  gperftools   failed  failed  failed

2025-Mar-09 07:09:29 :: test-only task #377422 for sisyphus started by vt:
#100 build 2.16.90-alt1 from /people/vt/packages/gperftools.git fetched at 2025-Mar-09 07:09:27
2025-Mar-09 07:09:31 :: [aarch64] #100 gperftools.git 2.16.90-alt1: build start
2025-Mar-09 07:09:31 :: [x86_64] #100 gperftools.git 2.16.90-alt1: build start
2025-Mar-09 07:09:31 :: [i586] #100 gperftools.git 2.16.90-alt1: build start
[x86_64] # SKIP:  0
[x86_64] # XFAIL: 0
[x86_64] # FAIL:  0
[x86_64] # XPASS: 0
[x86_64] # ERROR: 0
[x86_64] make[2]: Leaving directory '/usr/src/RPM/BUILD/gperftools-2.16.90'
[x86_64] --
[x86_64] Processing files: gperftools-2.16.90-alt1
[x86_64] error: File not found by glob: /usr/src/tmp/gperftools-buildroot/usr/bin/pprof*
[x86_64] error: File not found by glob: /usr/src/tmp/gperftools-buildroot/usr/share/man/man1/pprof.*
[x86_64] RPM build errors:
2025-Mar-09 07:10:20 :: [x86_64] gperftools.git 2.16.90-alt1: remote: build failed
2025-Mar-09 07:10:20 :: [x86_64] #100 gperftools.git 2.16.90-alt1: build FAILED
2025-Mar-09 07:10:20 :: [x86_64] requesting cancellation of task processing
[aarch64] # SKIP:  0
[aarch64] # XFAIL: 0
[aarch64] # FAIL:  0
[aarch64] # XPASS: 0
[aarch64] # ERROR: 0
[aarch64] make[2]: Leaving directory '/usr/src/RPM/BUILD/gperftools-2.16.90'
[aarch64] --
[aarch64] Processing files: gperftools-2.16.90-alt1
[aarch64] error: File not found by glob: /usr/src/tmp/gperftools-buildroot/usr/bin/pprof*
[aarch64] error: File not found by glob: /usr/src/tmp/gperftools-buildroot/usr/share/man/man1/pprof.*
[aarch64] RPM build errors:
2025-Mar-09 07:10:49 :: [aarch64] gperftools.git 2.16.90-alt1: remote: build failed
2025-Mar-09 07:10:49 :: [aarch64] #100 gperftools.git 2.16.90-alt1: build FAILED
[i586] # SKIP:  0
[i586] # XFAIL: 0
[i586] # FAIL:  0
[i586] # XPASS: 0
[i586] # ERROR: 0
[i586] make[2]: Leaving directory '/usr/src/RPM/BUILD/gperftools-2.16.90'
[i586] --
[i586] Processing files: gperftools-2.16.90-alt1
[i586] error: File not found by glob: /usr/src/tmp/gperftools-buildroot/usr/bin/pprof*
[i586] error: File not found by glob: /usr/src/tmp/gperftools-buildroot/usr/share/man/man1/pprof.*
[i586] RPM build errors:
2025-Mar-09 07:11:08 :: [i586] gperftools.git 2.16.90-alt1: remote: build failed
2025-Mar-09 07:11:08 :: [i586] #100 gperftools.git 2.16.90-alt1: build FAILED
2025-Mar-09 07:10:20 :: [x86_64] build FAILED
2025-Mar-09 07:10:49 :: [aarch64] build FAILED
2025-Mar-09 07:11:08 :: [i586] build FAILED
2025-Mar-09 07:11:08 :: task #377422 for sisyphus FAILED


More information about the Sisyphus-incominger mailing list