[#377414] [test-only] FAILED (try 2) budgie-backgrounds.git=3.0-alt1 budgie-control-center.git=1.4.0-alt1 ...

Girar awaiter (lav) girar-builder at altlinux.org
Sun Mar 9 01:15:45 MSK 2025


https://git.altlinux.org/tasks/377414/logs/events.2.1.log
https://packages.altlinux.org/tasks/377414

subtask  name                   aarch64    i586  x86_64
   #140  budgie-control-center   failed  failed  failed

2025-Mar-08 22:13:07 :: test-only task #377414 for sisyphus resumed by lav:
#100 build 3.0-alt1 from /people/lav/packages/budgie-backgrounds.git fetched at 2025-Mar-08 22:03:24
#140 build 1.4.0-alt1 from /people/lav/packages/budgie-control-center.git fetched at 2025-Mar-08 22:13:05
#200 removed
#300 build 1.3-alt1 from /people/lav/packages/budgie-desktop-view.git fetched at 2025-Mar-08 22:03:38
#400 build 5.1.0-alt1 from /people/lav/packages/budgie-screensaver.git fetched at 2025-Mar-08 22:03:51
#500 build 0.9.1-alt1 from /people/lav/packages/budgie-session.git fetched at 2025-Mar-08 22:04:20
2025-Mar-08 22:13:08 :: created build repo
2025-Mar-08 22:13:09 :: [i586] #100 budgie-backgrounds.git 3.0-alt1: build start
2025-Mar-08 22:13:09 :: [x86_64] #100 budgie-backgrounds.git 3.0-alt1: build start
2025-Mar-08 22:13:09 :: [aarch64] #100 budgie-backgrounds.git 3.0-alt1: build start
2025-Mar-08 22:13:26 :: [i586] #100 budgie-backgrounds.git 3.0-alt1: build OK (cached)
2025-Mar-08 22:13:27 :: [i586] #140 budgie-control-center.git 1.4.0-alt1: build start
2025-Mar-08 22:13:27 :: [x86_64] #100 budgie-backgrounds.git 3.0-alt1: build OK (cached)
2025-Mar-08 22:13:28 :: [x86_64] #140 budgie-control-center.git 1.4.0-alt1: build start
2025-Mar-08 22:13:44 :: [aarch64] #100 budgie-backgrounds.git 3.0-alt1: build OK (cached)
2025-Mar-08 22:13:44 :: [aarch64] #140 budgie-control-center.git 1.4.0-alt1: build start
[x86_64] Run-time dependency gnutls found: NO (tried pkgconfig)
[x86_64] panels/sharing/meson.build:79:13: ERROR: Dependency "gnutls" not found, tried pkgconfig
[x86_64] A full log can be found at /usr/src/RPM/BUILD/budgie-control-center-1.4.0/x86_64-alt-linux/meson-logs/meson-log.txt
2025-Mar-08 22:14:38 :: [x86_64] budgie-control-center.git 1.4.0-alt1: remote: build failed
2025-Mar-08 22:14:38 :: [x86_64] #140 budgie-control-center.git 1.4.0-alt1: build FAILED
2025-Mar-08 22:14:38 :: [x86_64] requesting cancellation of task processing
[i586] Run-time dependency gnutls found: NO (tried pkgconfig)
[i586] panels/sharing/meson.build:79:13: ERROR: Dependency "gnutls" not found, tried pkgconfig
[i586] A full log can be found at /usr/src/RPM/BUILD/budgie-control-center-1.4.0/i586-alt-linux/meson-logs/meson-log.txt
2025-Mar-08 22:14:43 :: [i586] budgie-control-center.git 1.4.0-alt1: remote: build failed
2025-Mar-08 22:14:43 :: [i586] #140 budgie-control-center.git 1.4.0-alt1: build FAILED
[aarch64] Run-time dependency gnutls found: NO (tried pkgconfig)
[aarch64] panels/sharing/meson.build:79:13: ERROR: Dependency "gnutls" not found, tried pkgconfig
[aarch64] A full log can be found at /usr/src/RPM/BUILD/budgie-control-center-1.4.0/aarch64-alt-linux/meson-logs/meson-log.txt
2025-Mar-08 22:15:44 :: [aarch64] budgie-control-center.git 1.4.0-alt1: remote: build failed
2025-Mar-08 22:15:44 :: [aarch64] #140 budgie-control-center.git 1.4.0-alt1: build FAILED
2025-Mar-08 22:14:38 :: [x86_64] build FAILED
2025-Mar-08 22:14:43 :: [i586] build FAILED
2025-Mar-08 22:15:44 :: [aarch64] build FAILED
2025-Mar-08 22:15:44 :: task #377414 for sisyphus FAILED


More information about the Sisyphus-incominger mailing list