[#377406] FAILED python3-module-jupyter_server.git=2.15.0-alt2
Girar awaiter (toni)
girar-builder at altlinux.org
Sat Mar 8 18:02:05 MSK 2025
https://git.altlinux.org/tasks/377406/logs/events.1.1.log
https://packages.altlinux.org/tasks/377406
subtask name aarch64 i586 x86_64
#100 python3-module-jupyter_server failed 4:03 3:53
2025-Mar-08 14:57:29 :: task #377406 for sisyphus started by toni:
#100 build 2.15.0-alt2 from /people/toni/packages/python3-module-jupyter_server.git fetched at 2025-Mar-08 14:57:28
2025-Mar-08 14:57:31 :: [x86_64] #100 python3-module-jupyter_server.git 2.15.0-alt2: build start
2025-Mar-08 14:57:31 :: [aarch64] #100 python3-module-jupyter_server.git 2.15.0-alt2: build start
2025-Mar-08 14:57:31 :: [i586] #100 python3-module-jupyter_server.git 2.15.0-alt2: build start
2025-Mar-08 15:01:24 :: [x86_64] #100 python3-module-jupyter_server.git 2.15.0-alt2: build OK
2025-Mar-08 15:01:34 :: [i586] #100 python3-module-jupyter_server.git 2.15.0-alt2: build OK
[aarch64] SKIPPED [7] tests/conftest.py:42: Skipping this test because it's marked 'integration_test'. Run integration tests using the `--integration_tests` flag.
[aarch64] FAILED tests/services/kernels/test_execution_state.py::test_execution_state
[aarch64] = 1 failed, 985 passed, 15 skipped, 8 deselected, 34 warnings in 226.36s (0:03:46) =
[aarch64] INFO : Command's result: FAILURE
[aarch64] INFO : Command's error: Command '['python3', '-m', 'pytest', '-v', '-W', 'default', '-m', 'not network', '-k', 'not test_restart_kernel and not test_connection']' returned non-zero exit status 1.
2025-Mar-08 15:02:05 :: [aarch64] python3-module-jupyter_server.git 2.15.0-alt2: remote: build failed
2025-Mar-08 15:02:05 :: [aarch64] #100 python3-module-jupyter_server.git 2.15.0-alt2: build FAILED
2025-Mar-08 15:02:05 :: [aarch64] requesting cancellation of task processing
2025-Mar-08 15:02:05 :: [aarch64] build FAILED
2025-Mar-08 15:02:05 :: task #377406 for sisyphus FAILED
More information about the Sisyphus-incominger
mailing list