[#377402] [test-only] FAILED alterator-entry.git=0.3.1-alt1

Girar awaiter (chernigin) girar-builder at altlinux.org
Sat Mar 8 16:10:33 MSK 2025


https://git.altlinux.org/tasks/377402/logs/events.1.1.log
https://packages.altlinux.org/tasks/377402

subtask  name             aarch64    i586  x86_64
   #100  alterator-entry   failed  failed  failed

2025-Mar-08 13:09:53 :: test-only task #377402 for sisyphus started by chernigin:
#100 build 0.3.1-alt1 from /people/chernigin/packages/alterator-entry.git fetched at 2025-Mar-08 13:09:30
2025-Mar-08 13:09:55 :: [aarch64] #100 alterator-entry.git 0.3.1-alt1: build start
2025-Mar-08 13:09:55 :: [i586] #100 alterator-entry.git 0.3.1-alt1: build start
2025-Mar-08 13:09:55 :: [x86_64] #100 alterator-entry.git 0.3.1-alt1: build start
[i586] Processing files: python3-module-alterator-entry-0.3.1-alt1
[i586] error: No such file or directory: /usr/src/tmp/alterator-entry-buildroot/usr/lib/python3/site-packages/alterator_entry-0.3.1.dist-info
[i586] RPM build errors:
[i586]     No such file or directory: /usr/src/tmp/alterator-entry-buildroot/usr/lib/python3/site-packages/alterator_entry-0.3.1.dist-info
2025-Mar-08 13:10:21 :: [i586] alterator-entry.git 0.3.1-alt1: remote: build failed
2025-Mar-08 13:10:21 :: [i586] #100 alterator-entry.git 0.3.1-alt1: build FAILED
2025-Mar-08 13:10:21 :: [i586] requesting cancellation of task processing
[x86_64] Processing files: python3-module-alterator-entry-0.3.1-alt1
[x86_64] error: No such file or directory: /usr/src/tmp/alterator-entry-buildroot/usr/lib/python3/site-packages/alterator_entry-0.3.1.dist-info
[x86_64] RPM build errors:
[x86_64]     No such file or directory: /usr/src/tmp/alterator-entry-buildroot/usr/lib/python3/site-packages/alterator_entry-0.3.1.dist-info
2025-Mar-08 13:10:31 :: [x86_64] alterator-entry.git 0.3.1-alt1: remote: build failed
2025-Mar-08 13:10:31 :: [x86_64] #100 alterator-entry.git 0.3.1-alt1: build FAILED
[aarch64] Processing files: python3-module-alterator-entry-0.3.1-alt1
[aarch64] error: No such file or directory: /usr/src/tmp/alterator-entry-buildroot/usr/lib/python3/site-packages/alterator_entry-0.3.1.dist-info
[aarch64] RPM build errors:
[aarch64]     No such file or directory: /usr/src/tmp/alterator-entry-buildroot/usr/lib/python3/site-packages/alterator_entry-0.3.1.dist-info
2025-Mar-08 13:10:32 :: [aarch64] alterator-entry.git 0.3.1-alt1: remote: build failed
2025-Mar-08 13:10:32 :: [aarch64] #100 alterator-entry.git 0.3.1-alt1: build FAILED
2025-Mar-08 13:10:21 :: [i586] build FAILED
2025-Mar-08 13:10:32 :: [x86_64] build FAILED
2025-Mar-08 13:10:33 :: [aarch64] build FAILED
2025-Mar-08 13:10:33 :: task #377402 for sisyphus FAILED


More information about the Sisyphus-incominger mailing list