[#377208] [test-only] FAILED alterator-entry.git=0.3-alt1
Girar awaiter (liannnix)
girar-builder at altlinux.org
Fri Mar 7 23:09:16 MSK 2025
https://git.altlinux.org/tasks/377208/logs/events.1.1.log
https://packages.altlinux.org/tasks/377208
subtask name aarch64 i586 x86_64
#100 alterator-entry failed failed failed
2025-Mar-07 20:08:35 :: test-only task #377208 for sisyphus started by liannnix:
#100 build 0.3-alt1 from /people/liannnix/packages/alterator-entry.git fetched at 2025-Mar-07 20:08:24
2025-Mar-07 20:08:37 :: [aarch64] #100 alterator-entry.git 0.3-alt1: build start
2025-Mar-07 20:08:37 :: [i586] #100 alterator-entry.git 0.3-alt1: build start
2025-Mar-07 20:08:37 :: [x86_64] #100 alterator-entry.git 0.3-alt1: build start
[x86_64] Processing files: python3-module-alterator-entry-0.3-alt1
[x86_64] error: No such file or directory: /usr/src/tmp/alterator-entry-buildroot/usr/lib/python3/site-packages/alterator_entry-0.3.dist-info
[x86_64] RPM build errors:
[x86_64] No such file or directory: /usr/src/tmp/alterator-entry-buildroot/usr/lib/python3/site-packages/alterator_entry-0.3.dist-info
2025-Mar-07 20:09:01 :: [x86_64] alterator-entry.git 0.3-alt1: remote: build failed
2025-Mar-07 20:09:01 :: [x86_64] #100 alterator-entry.git 0.3-alt1: build FAILED
2025-Mar-07 20:09:01 :: [x86_64] requesting cancellation of task processing
[i586] Processing files: python3-module-alterator-entry-0.3-alt1
[i586] error: No such file or directory: /usr/src/tmp/alterator-entry-buildroot/usr/lib/python3/site-packages/alterator_entry-0.3.dist-info
[i586] RPM build errors:
[i586] No such file or directory: /usr/src/tmp/alterator-entry-buildroot/usr/lib/python3/site-packages/alterator_entry-0.3.dist-info
2025-Mar-07 20:09:02 :: [i586] alterator-entry.git 0.3-alt1: remote: build failed
2025-Mar-07 20:09:02 :: [i586] #100 alterator-entry.git 0.3-alt1: build FAILED
[aarch64] Processing files: python3-module-alterator-entry-0.3-alt1
[aarch64] error: No such file or directory: /usr/src/tmp/alterator-entry-buildroot/usr/lib/python3/site-packages/alterator_entry-0.3.dist-info
[aarch64] RPM build errors:
[aarch64] No such file or directory: /usr/src/tmp/alterator-entry-buildroot/usr/lib/python3/site-packages/alterator_entry-0.3.dist-info
2025-Mar-07 20:09:15 :: [aarch64] alterator-entry.git 0.3-alt1: remote: build failed
2025-Mar-07 20:09:15 :: [aarch64] #100 alterator-entry.git 0.3-alt1: build FAILED
2025-Mar-07 20:09:01 :: [x86_64] build FAILED
2025-Mar-07 20:09:02 :: [i586] build FAILED
2025-Mar-07 20:09:15 :: [aarch64] build FAILED
2025-Mar-07 20:09:16 :: task #377208 for sisyphus FAILED
More information about the Sisyphus-incominger
mailing list