[#376916] [test-only] FAILED (try 2) firefox.git=136.0-alt1
Girar awaiter (rauty)
girar-builder at altlinux.org
Fri Mar 7 15:59:52 MSK 2025
https://git.altlinux.org/tasks/376916/logs/events.2.1.log
https://packages.altlinux.org/tasks/376916
subtask name aarch64 i586 x86_64
#40 firefox failed failed failed
2025-Mar-07 12:22:04 :: test-only task #376916 for sisyphus resumed by rauty:
#40 build 136.0-alt1 from /people/rauty/packages/firefox.git fetched at 2025-Mar-07 12:20:26
#100 removed
2025-Mar-07 12:22:06 :: [x86_64] #40 firefox.git 136.0-alt1: build start
2025-Mar-07 12:22:06 :: [aarch64] #40 firefox.git 136.0-alt1: build start
2025-Mar-07 12:22:06 :: [i586] #40 firefox.git 136.0-alt1: build start
[x86_64] 16:41.99 Finished `release` profile [optimized] target(s) in 16m 18s
[x86_64] 16:43.85 toolkit/library/rust/libgkrust.a
[x86_64] 16:43.85 gmake[2]: *** [/usr/src/RPM/BUILD/firefox-136.0/config/recurse.mk:34: compile] Error 2
[x86_64] 16:43.86 gmake[1]: *** [/usr/src/RPM/BUILD/firefox-136.0/config/rules.mk:359: default] Error 2
[x86_64] 16:43.86 gmake: *** [client.mk:60: build] Error 2
[x86_64] 16:43.96 W 168 compiler warnings present.
[x86_64] 16:44.10 W Notification center failed: Install notify-send (usually part of the libnotify package) to get a notification when the build finishes.
[x86_64] Config object not found by mach.
[x86_64] Configure complete!
[x86_64] Be sure to run |mach build| to pick up any changes
2025-Mar-07 12:42:48 :: [x86_64] firefox.git 136.0-alt1: remote: build failed
2025-Mar-07 12:42:48 :: [x86_64] #40 firefox.git 136.0-alt1: build FAILED
2025-Mar-07 12:42:48 :: [x86_64] requesting cancellation of task processing
[i586] 16:36.97 Finished `release` profile [optimized] target(s) in 16m 11s
[i586] 16:39.12 toolkit/library/rust/libgkrust.a
[i586] 16:39.12 gmake[2]: *** [/usr/src/RPM/BUILD/firefox-136.0/config/recurse.mk:34: compile] Error 2
[i586] 16:39.12 gmake[1]: *** [/usr/src/RPM/BUILD/firefox-136.0/config/rules.mk:359: default] Error 2
[i586] 16:39.12 gmake: *** [client.mk:60: build] Error 2
[i586] 16:39.22 W 185 compiler warnings present.
[i586] 16:39.39 W Notification center failed: Install notify-send (usually part of the libnotify package) to get a notification when the build finishes.
[i586] Config object not found by mach.
[i586] Configure complete!
[i586] Be sure to run |mach build| to pick up any changes
2025-Mar-07 12:44:45 :: [i586] firefox.git 136.0-alt1: remote: build failed
2025-Mar-07 12:44:45 :: [i586] #40 firefox.git 136.0-alt1: build FAILED
[aarch64] 30:47.90 Finished `release` profile [optimized] target(s) in 30m 06s
[aarch64] 30:51.61 toolkit/library/rust/libgkrust.a
[aarch64] 30:51.62 gmake[2]: *** [/usr/src/RPM/BUILD/firefox-136.0/config/recurse.mk:34: compile] Error 2
[aarch64] 30:51.62 gmake[1]: *** [/usr/src/RPM/BUILD/firefox-136.0/config/rules.mk:359: default] Error 2
[aarch64] 30:51.62 gmake: *** [client.mk:60: build] Error 2
[aarch64] 30:51.72 W 171 compiler warnings present.
[aarch64] 30:52.22 W Notification center failed: Install notify-send (usually part of the libnotify package) to get a notification when the build finishes.
[aarch64] Config object not found by mach.
[aarch64] Configure complete!
[aarch64] Be sure to run |mach build| to pick up any changes
2025-Mar-07 12:59:52 :: [aarch64] firefox.git 136.0-alt1: remote: build failed
2025-Mar-07 12:59:52 :: [aarch64] #40 firefox.git 136.0-alt1: build FAILED
2025-Mar-07 12:42:49 :: [x86_64] build FAILED
2025-Mar-07 12:44:45 :: [i586] build FAILED
2025-Mar-07 12:59:52 :: [aarch64] build FAILED
2025-Mar-07 12:59:52 :: task #376916 for sisyphus FAILED
More information about the Sisyphus-incominger
mailing list