[#377179] [test-only] FAILED qadwaitadecorations-activator.git=0.1.1-alt1

Girar awaiter (qualimock) girar-builder at altlinux.org
Fri Mar 7 14:45:48 MSK 2025


https://git.altlinux.org/tasks/377179/logs/events.1.1.log
https://packages.altlinux.org/tasks/377179

subtask  name                           aarch64    i586  x86_64
   #100  qadwaitadecorations-activator   failed  failed  failed

2025-Mar-07 11:45:27 :: test-only task #377179 for sisyphus started by qualimock:
#100 build 0.1.1-alt1 from /people/qualimock/packages/qadwaitadecorations-activator.git fetched at 2025-Mar-07 11:45:07
2025-Mar-07 11:45:29 :: [x86_64] #100 qadwaitadecorations-activator.git 0.1.1-alt1: build start
2025-Mar-07 11:45:29 :: [aarch64] #100 qadwaitadecorations-activator.git 0.1.1-alt1: build start
2025-Mar-07 11:45:29 :: [i586] #100 qadwaitadecorations-activator.git 0.1.1-alt1: build start
[i586] Cleaning files in /usr/src/tmp/qadwaitadecorations-activator-buildroot (auto)
[i586] find: 'usr': No such file or directory
[i586] Verifying and fixing files in /usr/src/tmp/qadwaitadecorations-activator-buildroot (binconfig,pkgconfig,libtool,desktop,gnuconfig)
[i586] --
[i586] Processing files: qadwaitadecorations-activator-0.1.1-alt1
[i586] error: No such file or directory: /usr/src/tmp/qadwaitadecorations-activator-buildroot/etc/qadwaitadecorations-activator.sh
[i586] RPM build errors:
[i586]     No such file or directory: /usr/src/tmp/qadwaitadecorations-activator-buildroot/etc/qadwaitadecorations-activator.sh
2025-Mar-07 11:45:41 :: [i586] qadwaitadecorations-activator.git 0.1.1-alt1: remote: build failed
2025-Mar-07 11:45:41 :: [i586] #100 qadwaitadecorations-activator.git 0.1.1-alt1: build FAILED
2025-Mar-07 11:45:41 :: [i586] requesting cancellation of task processing
[x86_64] Cleaning files in /usr/src/tmp/qadwaitadecorations-activator-buildroot (auto)
[x86_64] find: 'usr': No such file or directory
[x86_64] Verifying and fixing files in /usr/src/tmp/qadwaitadecorations-activator-buildroot (binconfig,pkgconfig,libtool,desktop,gnuconfig)
[x86_64] --
[x86_64] Processing files: qadwaitadecorations-activator-0.1.1-alt1
[x86_64] error: No such file or directory: /usr/src/tmp/qadwaitadecorations-activator-buildroot/etc/qadwaitadecorations-activator.sh
[x86_64] RPM build errors:
[x86_64]     No such file or directory: /usr/src/tmp/qadwaitadecorations-activator-buildroot/etc/qadwaitadecorations-activator.sh
2025-Mar-07 11:45:41 :: [x86_64] qadwaitadecorations-activator.git 0.1.1-alt1: remote: build failed
2025-Mar-07 11:45:41 :: [x86_64] #100 qadwaitadecorations-activator.git 0.1.1-alt1: build FAILED
[aarch64] Cleaning files in /usr/src/tmp/qadwaitadecorations-activator-buildroot (auto)
[aarch64] find: 'usr': No such file or directory
[aarch64] Verifying and fixing files in /usr/src/tmp/qadwaitadecorations-activator-buildroot (binconfig,pkgconfig,libtool,desktop,gnuconfig)
[aarch64] --
[aarch64] Processing files: qadwaitadecorations-activator-0.1.1-alt1
[aarch64] error: No such file or directory: /usr/src/tmp/qadwaitadecorations-activator-buildroot/etc/qadwaitadecorations-activator.sh
[aarch64] RPM build errors:
[aarch64]     No such file or directory: /usr/src/tmp/qadwaitadecorations-activator-buildroot/etc/qadwaitadecorations-activator.sh
2025-Mar-07 11:45:47 :: [aarch64] qadwaitadecorations-activator.git 0.1.1-alt1: remote: build failed
2025-Mar-07 11:45:47 :: [aarch64] #100 qadwaitadecorations-activator.git 0.1.1-alt1: build FAILED
2025-Mar-07 11:45:41 :: [i586] build FAILED
2025-Mar-07 11:45:41 :: [x86_64] build FAILED
2025-Mar-07 11:45:47 :: [aarch64] build FAILED
2025-Mar-07 11:45:47 :: task #377179 for sisyphus FAILED


More information about the Sisyphus-incominger mailing list