[#377157] [test-only] p10 FAILED (try 3) python3-module-k5test.git=0.10.4-alt1 ...

Girar awaiter (greh) girar-builder at altlinux.org
Fri Mar 7 13:19:55 MSK 2025


https://git.altlinux.org/tasks/377157/logs/events.3.1.log
https://packages.altlinux.org/tasks/377157

subtask  name                   aarch64  armh    i586  x86_64
   #220  python3-module-spnego   failed     ?  failed  failed

2025-Mar-07 10:18:38 :: test-only task #377157 for p10 resumed by greh:
#100 build 0.10.4-alt1 from /gears/p/python3-module-k5test.git fetched at 2025-Mar-07 09:54:38 from p11
#200 build 0.5.1-alt1 from /gears/p/python3-module-krb5.git fetched at 2025-Mar-07 09:55:26 from p11
#220 build 0.10.2-alt1 from /gears/p/python3-module-spnego.git fetched at 2025-Mar-07 10:18:26 from p11
#240 build 0.2.0-alt1 from /gears/p/python3-module-dpapi-ng.git fetched at 2025-Mar-07 10:12:26 from p11
#300 build 0.13.0-alt1 from /people/greh/packages/gpupdate.git fetched at 2025-Mar-07 09:56:23
2025-Mar-07 10:18:38 :: created build repo
2025-Mar-07 10:18:39 :: [aarch64] #100 python3-module-k5test.git 0.10.4-alt1: build start
2025-Mar-07 10:18:39 :: [i586] #100 python3-module-k5test.git 0.10.4-alt1: build start
2025-Mar-07 10:18:39 :: [x86_64] #100 python3-module-k5test.git 0.10.4-alt1: build start
2025-Mar-07 10:18:39 :: [armh] #100 python3-module-k5test.git 0.10.4-alt1: build start
2025-Mar-07 10:18:50 :: [i586] #100 python3-module-k5test.git 0.10.4-alt1: build OK (cached)
2025-Mar-07 10:18:51 :: [i586] #200 python3-module-krb5.git 0.5.1-alt1: build start
2025-Mar-07 10:18:51 :: [x86_64] #100 python3-module-k5test.git 0.10.4-alt1: build OK (cached)
2025-Mar-07 10:18:51 :: [x86_64] #200 python3-module-krb5.git 0.5.1-alt1: build start
2025-Mar-07 10:18:59 :: [aarch64] #100 python3-module-k5test.git 0.10.4-alt1: build OK (cached)
2025-Mar-07 10:19:00 :: [aarch64] #200 python3-module-krb5.git 0.5.1-alt1: build start
2025-Mar-07 10:19:02 :: [i586] #200 python3-module-krb5.git 0.5.1-alt1: build OK (cached)
2025-Mar-07 10:19:02 :: [i586] #220 python3-module-spnego.git 0.10.2-alt1: build start
2025-Mar-07 10:19:03 :: [x86_64] #200 python3-module-krb5.git 0.5.1-alt1: build OK (cached)
2025-Mar-07 10:19:03 :: [x86_64] #220 python3-module-spnego.git 0.10.2-alt1: build start
2025-Mar-07 10:19:08 :: [armh] #100 python3-module-k5test.git 0.10.4-alt1: build OK (cached)
2025-Mar-07 10:19:08 :: [armh] #200 python3-module-krb5.git 0.5.1-alt1: build start
2025-Mar-07 10:19:20 :: [aarch64] #200 python3-module-krb5.git 0.5.1-alt1: build OK (cached)
2025-Mar-07 10:19:20 :: [aarch64] #220 python3-module-spnego.git 0.10.2-alt1: build start
[x86_64] + sed -i 's/main()/main(sys.argv[1:])/' /usr/src/tmp/python3-module-spnego-buildroot/usr/bin/pyspnego-parse
[x86_64] sed: can't read /usr/src/tmp/python3-module-spnego-buildroot/usr/bin/pyspnego-parse: No such file or directory
2025-Mar-07 10:19:23 :: [x86_64] python3-module-spnego.git 0.10.2-alt1: remote: build failed
2025-Mar-07 10:19:23 :: [x86_64] #220 python3-module-spnego.git 0.10.2-alt1: build FAILED
2025-Mar-07 10:19:23 :: [x86_64] requesting cancellation of task processing
[i586] + sed -i 's/main()/main(sys.argv[1:])/' /usr/src/tmp/python3-module-spnego-buildroot/usr/bin/pyspnego-parse
[i586] sed: can't read /usr/src/tmp/python3-module-spnego-buildroot/usr/bin/pyspnego-parse: No such file or directory
2025-Mar-07 10:19:24 :: [i586] python3-module-spnego.git 0.10.2-alt1: remote: build failed
2025-Mar-07 10:19:24 :: [i586] #220 python3-module-spnego.git 0.10.2-alt1: build FAILED
2025-Mar-07 10:19:38 :: [armh] #200 python3-module-krb5.git 0.5.1-alt1: build OK (cached)
2025-Mar-07 10:19:38 :: [armh] task processing CANCELLED
[aarch64] + sed -i 's/main()/main(sys.argv[1:])/' /usr/src/tmp/python3-module-spnego-buildroot/usr/bin/pyspnego-parse
[aarch64] sed: can't read /usr/src/tmp/python3-module-spnego-buildroot/usr/bin/pyspnego-parse: No such file or directory
2025-Mar-07 10:19:54 :: [aarch64] python3-module-spnego.git 0.10.2-alt1: remote: build failed
2025-Mar-07 10:19:54 :: [aarch64] #220 python3-module-spnego.git 0.10.2-alt1: build FAILED
2025-Mar-07 10:19:24 :: [x86_64] build FAILED
2025-Mar-07 10:19:24 :: [i586] build FAILED
2025-Mar-07 10:19:38 :: [armh] build FAILED
2025-Mar-07 10:19:54 :: [aarch64] build FAILED
2025-Mar-07 10:19:54 :: task #377157 for p10 FAILED


More information about the Sisyphus-incominger mailing list