[#376957] FAILED srpm=chromium-134.0.6998.35-alt1.src.rpm
Girar awaiter (andy)
girar-builder at altlinux.org
Wed Mar 5 18:04:42 MSK 2025
https://git.altlinux.org/tasks/376957/logs/events.1.1.log
https://packages.altlinux.org/tasks/376957
subtask name aarch64 i586 ppc64le x86_64
#100 chromium - - - failed
2025-Mar-05 14:59:14 :: task #376957 for sisyphus started by andy:
#100 build chromium-134.0.6998.35-alt1.src.rpm
2025-Mar-05 14:59:16 :: [i586] #100 chromium-134.0.6998.35-alt1.src.rpm: build start
2025-Mar-05 14:59:16 :: [x86_64] #100 chromium-134.0.6998.35-alt1.src.rpm: build start
2025-Mar-05 14:59:16 :: [aarch64] #100 chromium-134.0.6998.35-alt1.src.rpm: build start
2025-Mar-05 14:59:16 :: [ppc64le] #100 chromium-134.0.6998.35-alt1.src.rpm: build start
2025-Mar-05 15:00:00 :: [i586] #100 chromium-134.0.6998.35-alt1.src.rpm: build SKIPPED
2025-Mar-05 15:00:21 :: [aarch64] #100 chromium-134.0.6998.35-alt1.src.rpm: build SKIPPED
2025-Mar-05 15:00:23 :: [ppc64le] #100 chromium-134.0.6998.35-alt1.src.rpm: build SKIPPED
[x86_64] [chrome 375/50893] ln -f default_for_rust_host_build_tools/obj/build/rust/std/libadler2.rlib default_for_rust_host_build_tools/prebuilt_rustc_sysroot/lib/rustlib/x86_64-unknown-linux-gnu/lib/libadler2.rlib 2>/dev/null || (rm -rf default_for_rust_host_build_tools/prebuilt_rustc_sysroot/lib/rustlib/x86_64-unknown-linux-gnu/lib/libadler2.rlib && cp -af default_for_rust_host_build_tools/obj/build/rust/std/libadler2.rlib default_for_rust_host_build_tools/prebuilt_rustc_sysroot/lib/rustlib/x86_64-unknown-linux-gnu/lib/libadler2.rlib)
[x86_64] FAILED: default_for_rust_host_build_tools/prebuilt_rustc_sysroot/lib/rustlib/x86_64-unknown-linux-gnu/lib/libadler2.rlib
[x86_64] ln -f default_for_rust_host_build_tools/obj/build/rust/std/libadler2.rlib default_for_rust_host_build_tools/prebuilt_rustc_sysroot/lib/rustlib/x86_64-unknown-linux-gnu/lib/libadler2.rlib 2>/dev/null || (rm -rf default_for_rust_host_build_tools/prebuilt_rustc_sysroot/lib/rustlib/x86_64-unknown-linux-gnu/lib/libadler2.rlib && cp -af default_for_rust_host_build_tools/obj/build/rust/std/libadler2.rlib default_for_rust_host_build_tools/prebuilt_rustc_sysroot/lib/rustlib/x86_64-unknown-linux-gnu/lib/libadler2.rlib)
[x86_64] cp: cannot stat 'default_for_rust_host_build_tools/obj/build/rust/std/libadler2.rlib': No such file or directory
[x86_64] [chrome 376/50893] clang++ -MD -MF obj/base/allocator/partition_allocator/src/partition_alloc/allocator_base/check.o.d -DUSE_UDEV -DUSE_AURA=1 -DUSE_GLIB=1 -DUSE_OZONE=1 -DOFFICIAL_BUILD -D__STDC_CONSTANT_MACROS -D__STDC_FORMAT_MACROS -D_FORTIFY_SOURCE=2 -D_FILE_OFFSET_BITS=64 -D_LARGEFILE_SOURCE -D_LARGEFILE64_SOURCE -DNO_UNWIND_TABLES -D_GNU_SOURCE -D_LIBCPP_HARDENING_MODE=_LIBCPP_HARDENING_MODE_NONE -D_GLIBCXX_ASSERTIONS=1 -DNDEBUG -DNVALGRIND -DDYNAMIC_ANNOTATIONS_ENABLED=0 -DIS_PARTITION_ALLOC_BASE_IMPL -I../.. -Igen -I../../base/allocator/partition_allocator/src -Igen/base/allocator/partition_allocator/src -Wall -Wextra -Wimplicit-fallthrough -Wextra-semi -Wunreachable-code-aggressive -Wthread-safety -Wgnu -Wno-gnu-anonymous-struct -Wno-gnu-conditional-omitted-operand -Wno-gnu-include-next -Wno-gnu-label-as-value -Wno-gnu-redeclared-enum -Wno-gnu-statement-expression -Wno-gnu-zero-variadic-macro-arguments -Wno-zero-length-array -Wno-missing-field-initializers -Wno-unused-parameter -Wno-psabi -Wloop-analysis -Wno-unneeded-internal-declaration -Wno-cast-function-type -Wno-thread-safety-reference-return -Wshadow -fno-delete-null-pointer-checks -fwrapv -fno-ident -fno-strict-aliasing -fstack-protector -fno-unwind-tables -fno-asynchronous-unwind-tables -fPIC -pthread -fcolor-diagnostics -fmerge-all-constants -fno-sized-deallocation -fcrash-diagnostics-dir=../../tools/clang/crashreports -mllvm -instcombine-lower-dbg-declare=0 -ffp-contract=off -Wa,--crel,--allow-experimental-crel -flto=thin -fsplit-lto-unit -mllvm -inlinehint-threshold=360 -fwhole-program-vtables -m64 -msse3 -ftrivial-auto-var-init=pattern -fno-omit-frame-pointer -g0 -fvisibility=hidden -Wheader-hygiene -Wstring-conversion -Wtautological-overlap-compare -Wexit-time-destructors -O3 -fdata-sections -ffunction-sections -fno-unique-section-names -fno-math-errno -Wc++11-narrowing -Wconditional-uninitialized -Wcstring-format-directive -Wctad-maybe-unsupported -Wdeprecated-copy -Wdeprecated-copy-dtor -Wduplicate-enum -Wextra-semi -Wextra-semi-stmt -Widiomatic-parentheses -Wimplicit-fallthrough -Winconsistent-missing-destructor-override -Winvalid-offsetof -Wmissing-field-initializers -Wnon-c-typedef-for-linkage -Wpessimizing-move -Wrange-loop-analysis -Wredundant-move -Wshadow-field -Wstrict-prototypes -Wsuggest-destructor-override -Wsuggest-override -Wtautological-unsigned-zero-compare -Wunreachable-code-aggressive -Wunused-but-set-variable -Wunused-macros -pedantic -Wno-invalid-offsetof -Wenum-compare-conditional -Wno-c++11-narrowing-const-reference -Wno-missing-template-arg-list-after-template-kw -std=c++20 -Wno-trigraphs -gsimple-template-names -fno-exceptions -fno-rtti -fvisibility-inlines-hidden -Wno-unknown-warning-option -Wno-deprecated-declarations -Wno-unknown-pragmas -Wno-unused-command-line-argument -Wno-unused-but-set-variable -Wno-unused-result -Wno-unused-function -Wno-unused-variable -Wno-unused-private-field -Wno-unused-const-variable -Wno-unneeded-internal-declaration -Wno-unknown-attributes -Wno-conversion -fno-delete-null-pointer-checks -DUSE_SYSTEM_MINIZIP -stdlib=libc++ -I/usr/include/c++/v1 -Wno-error -Wno-undef -c ../../base/allocator/partition_allocator/src/partition_alloc/partition_alloc_base/check.cc -o obj/base/allocator/partition_allocator/src/partition_alloc/allocator_base/check.o
2025-Mar-05 15:04:41 :: [x86_64] chromium-134.0.6998.35-alt1.src.rpm: remote: build failed
2025-Mar-05 15:04:41 :: [x86_64] #100 chromium-134.0.6998.35-alt1.src.rpm: build FAILED
2025-Mar-05 15:04:41 :: [x86_64] requesting cancellation of task processing
2025-Mar-05 15:04:41 :: [x86_64] build FAILED
2025-Mar-05 15:04:42 :: task #376957 for sisyphus FAILED
More information about the Sisyphus-incominger
mailing list