[#376939] [test-only] FAILED talos.git=1.10.0-alt0.alpha.2
Girar awaiter (shaba)
girar-builder at altlinux.org
Wed Mar 5 15:25:56 MSK 2025
https://git.altlinux.org/tasks/376939/logs/events.1.1.log
https://packages.altlinux.org/tasks/376939
subtask name aarch64 i586 ppc64le x86_64
#100 talos failed - - failed
2025-Mar-05 12:24:25 :: test-only task #376939 for sisyphus started by shaba:
#100 build 1.10.0-alt0.alpha.2 from /people/shaba/packages/talos.git fetched at 2025-Mar-05 12:24:23
2025-Mar-05 12:24:27 :: [ppc64le] #100 talos.git 1.10.0-alt0.alpha.2: build start
2025-Mar-05 12:24:27 :: [x86_64] #100 talos.git 1.10.0-alt0.alpha.2: build start
2025-Mar-05 12:24:27 :: [i586] #100 talos.git 1.10.0-alt0.alpha.2: build start
2025-Mar-05 12:24:27 :: [aarch64] #100 talos.git 1.10.0-alt0.alpha.2: build start
2025-Mar-05 12:24:39 :: [i586] #100 talos.git 1.10.0-alt0.alpha.2: build SKIPPED
2025-Mar-05 12:24:50 :: [ppc64le] #100 talos.git 1.10.0-alt0.alpha.2: build SKIPPED
[x86_64] packagefile golang.org/x/sys/unix=/usr/src/tmp/go-build956205300/b243/_pkg_.a
[x86_64] packagefile io=/usr/src/tmp/go-build956205300/b030/_pkg_.a
[x86_64] packagefile log=/usr/src/tmp/go-build956205300/b168/_pkg_.a
[x86_64] packagefile os=/usr/src/tmp/go-build956205300/b052/_pkg_.a
[x86_64] packagefile runtime=/usr/src/tmp/go-build956205300/b010/_pkg_.a
[x86_64] packagefile sync=/usr/src/tmp/go-build956205300/b031/_pkg_.a
[x86_64] EOF
[x86_64] /usr/lib/golang/pkg/tool/linux_amd64/compile -o $WORK/b754/_pkg_.a -trimpath "$WORK/b754=>" -p github.com/siderolabs/talos/internal/pkg/meta -lang=go1.24 -complete -buildid L-18QkaM196c483026N3/L-18QkaM196c483026N3 -goversion go1.24.0 -c=4 -nolocalimports -importcfg $WORK/b754/importcfg -pack /usr/src/RPM/BUILD/talos-1.10.0/internal/pkg/meta/meta.go
[x86_64] /usr/lib/golang/pkg/tool/linux_amd64/buildid -w $WORK/b754/_pkg_.a # internal
[x86_64] cp $WORK/b754/_pkg_.a /usr/src/.cache/go-build/9f/9fba35685b6739939861c2f1810677652cd8f83db1905ace99d4669d5fcd73d9-d # internal
2025-Mar-05 12:25:20 :: [x86_64] talos.git 1.10.0-alt0.alpha.2: remote: build failed
2025-Mar-05 12:25:20 :: [x86_64] #100 talos.git 1.10.0-alt0.alpha.2: build FAILED
2025-Mar-05 12:25:20 :: [x86_64] requesting cancellation of task processing
[aarch64] packagefile golang.org/x/sys/unix=/usr/src/tmp/go-build2302726970/b242/_pkg_.a
[aarch64] packagefile io=/usr/src/tmp/go-build2302726970/b030/_pkg_.a
[aarch64] packagefile log=/usr/src/tmp/go-build2302726970/b168/_pkg_.a
[aarch64] packagefile os=/usr/src/tmp/go-build2302726970/b052/_pkg_.a
[aarch64] packagefile runtime=/usr/src/tmp/go-build2302726970/b010/_pkg_.a
[aarch64] packagefile sync=/usr/src/tmp/go-build2302726970/b031/_pkg_.a
[aarch64] EOF
[aarch64] /usr/lib/golang/pkg/tool/linux_arm64/compile -o $WORK/b752/_pkg_.a -trimpath "$WORK/b752=>" -p github.com/siderolabs/talos/internal/pkg/meta -lang=go1.24 -complete -buildid 6LCJq8Dn0Q-GLXODwOsm/6LCJq8Dn0Q-GLXODwOsm -goversion go1.24.0 -c=4 -nolocalimports -importcfg $WORK/b752/importcfg -pack /usr/src/RPM/BUILD/talos-1.10.0/internal/pkg/meta/meta.go
[aarch64] /usr/lib/golang/pkg/tool/linux_arm64/buildid -w $WORK/b752/_pkg_.a # internal
[aarch64] cp $WORK/b752/_pkg_.a /usr/src/.cache/go-build/ba/ba3693ff5e2742e9e5e0bc99d14043f1e3e54273bcce8e8bc904c8cb9bc465d0-d # internal
2025-Mar-05 12:25:56 :: [aarch64] talos.git 1.10.0-alt0.alpha.2: remote: build failed
2025-Mar-05 12:25:56 :: [aarch64] #100 talos.git 1.10.0-alt0.alpha.2: build FAILED
2025-Mar-05 12:25:21 :: [x86_64] build FAILED
2025-Mar-05 12:25:56 :: [aarch64] build FAILED
2025-Mar-05 12:25:56 :: task #376939 for sisyphus FAILED
More information about the Sisyphus-incominger
mailing list