[#376914] [test-only] p11 FAILED alt-components-base.git=0.2.7-alt2 alt-editions-server.git=0.1.5-alt1 ...
Girar awaiter (chernigin)
girar-builder at altlinux.org
Wed Mar 5 14:57:14 MSK 2025
https://git.altlinux.org/tasks/376914/logs/events.1.1.log
https://packages.altlinux.org/tasks/376914
subtask name aarch64 i586 x86_64
#100 alt-components-base failed failed failed
2025-Mar-05 11:56:37 :: test-only task #376914 for p11 started by chernigin:
#100 build 0.2.7-alt2 from /people/chernigin/packages/alt-components-base.git fetched at 2025-Mar-05 11:49:16
#200 build 0.1.5-alt1 from /people/chernigin/packages/alt-editions-server.git fetched at 2025-Mar-05 11:52:59
#300 build 0.1.0-alt1 from /people/chernigin/packages/alt-os-editions.git fetched at 2025-Mar-05 11:55:19
#400 build 0.2.4-alt1 from /people/chernigin/packages/alterator-entry.git fetched at 2025-Mar-05 11:56:25
2025-Mar-05 11:56:37 :: created build repo
2025-Mar-05 11:56:38 :: [aarch64] #100 alt-components-base.git 0.2.7-alt2: build start
2025-Mar-05 11:56:38 :: [i586] #100 alt-components-base.git 0.2.7-alt2: build start
2025-Mar-05 11:56:38 :: [x86_64] #100 alt-components-base.git 0.2.7-alt2: build start
[i586] Reading Package Lists...
[i586] Building Dependency Tree...
[i586] MI2a: marked for install (shallow): cmark
[i586] MI2a: satisfying Depends: libcmark0.31.1 = 0.31.1-alt1:p11+354951.100.3.1
[i586] MI2a: maybe install (a direct target): libcmark0.31.1 0.31.1-alt1:p11+354951.100.3.1 at 1725770294
[i586] MI2a: target SELECTED: libcmark0.31.1 0.31.1-alt1:p11+354951.100.3.1 at 1725770294
[i586] MI2a: requesting to install libcmark0.31.1 (unspec'd ver; inspect with Debug::pkgMark-shallow)
[i586] MI2a: marked for install (shallow): libcmark0.31.1
[i586] E: Version >='0.2.0' for 'alterator-entry' was not found
[i586] hsh-install: Failed to calculate package file list.
[i586] hsh-install: Failed to generate package file list.
2025-Mar-05 11:56:55 :: [i586] alt-components-base.git 0.2.7-alt2: remote: cannot build src.rpm
2025-Mar-05 11:56:55 :: [i586] #100 alt-components-base.git 0.2.7-alt2: build FAILED
2025-Mar-05 11:56:55 :: [i586] requesting cancellation of task processing
[x86_64] Reading Package Lists...
[x86_64] Building Dependency Tree...
[x86_64] MI2a: marked for install (shallow): cmark
[x86_64] MI2a: satisfying Depends: libcmark0.31.1 = 0.31.1-alt1:p11+354951.100.3.1
[x86_64] MI2a: maybe install (a direct target): libcmark0.31.1 0.31.1-alt1:p11+354951.100.3.1 at 1725770292
[x86_64] MI2a: target SELECTED: libcmark0.31.1 0.31.1-alt1:p11+354951.100.3.1 at 1725770292
[x86_64] MI2a: requesting to install libcmark0.31.1 (unspec'd ver; inspect with Debug::pkgMark-shallow)
[x86_64] MI2a: marked for install (shallow): libcmark0.31.1
[x86_64] E: Version >='0.2.0' for 'alterator-entry' was not found
[x86_64] hsh-install: Failed to calculate package file list.
[x86_64] hsh-install: Failed to generate package file list.
2025-Mar-05 11:56:56 :: [x86_64] alt-components-base.git 0.2.7-alt2: remote: cannot build src.rpm
2025-Mar-05 11:56:56 :: [x86_64] #100 alt-components-base.git 0.2.7-alt2: build FAILED
[aarch64] Reading Package Lists...
[aarch64] Building Dependency Tree...
[aarch64] MI2a: marked for install (shallow): cmark
[aarch64] MI2a: satisfying Depends: libcmark0.31.1 = 0.31.1-alt1:p11+354951.100.3.1
[aarch64] MI2a: maybe install (a direct target): libcmark0.31.1 0.31.1-alt1:p11+354951.100.3.1 at 1725770314
[aarch64] MI2a: target SELECTED: libcmark0.31.1 0.31.1-alt1:p11+354951.100.3.1 at 1725770314
[aarch64] MI2a: requesting to install libcmark0.31.1 (unspec'd ver; inspect with Debug::pkgMark-shallow)
[aarch64] MI2a: marked for install (shallow): libcmark0.31.1
[aarch64] E: Version >='0.2.0' for 'alterator-entry' was not found
[aarch64] hsh-install: Failed to calculate package file list.
[aarch64] hsh-install: Failed to generate package file list.
2025-Mar-05 11:57:14 :: [aarch64] alt-components-base.git 0.2.7-alt2: remote: cannot build src.rpm
2025-Mar-05 11:57:14 :: [aarch64] #100 alt-components-base.git 0.2.7-alt2: build FAILED
2025-Mar-05 11:56:55 :: [i586] build FAILED
2025-Mar-05 11:56:56 :: [x86_64] build FAILED
2025-Mar-05 11:57:14 :: [aarch64] build FAILED
2025-Mar-05 11:57:14 :: task #376914 for p11 FAILED
More information about the Sisyphus-incominger
mailing list