[#376898] [test-only] FAILED libopencv.git=4.11.0-alt1

Girar awaiter (rider) girar-builder at altlinux.org
Wed Mar 5 11:58:38 MSK 2025


https://git.altlinux.org/tasks/376898/logs/events.1.1.log
https://packages.altlinux.org/tasks/376898

subtask  name       aarch64   i586  ppc64le  x86_64
   #100  libopencv   failed  21:32   failed   17:55

2025-Mar-05 08:28:43 :: test-only task #376898 for sisyphus started by rider:
#100 build 4.11.0-alt1 from /people/rider/packages/libopencv.git fetched at 2025-Mar-05 08:28:41
2025-Mar-05 08:28:44 :: [i586] #100 libopencv.git 4.11.0-alt1: build start
2025-Mar-05 08:28:44 :: [aarch64] #100 libopencv.git 4.11.0-alt1: build start
2025-Mar-05 08:28:44 :: [x86_64] #100 libopencv.git 4.11.0-alt1: build start
2025-Mar-05 08:28:44 :: [ppc64le] #100 libopencv.git 4.11.0-alt1: build start
[ppc64le]  1602 | inline void v_sincos(const v_float32x4& x, v_float32x4& s, v_float32x4& c) { v_sincos_default_32f<v_float32x4, v_int32x4>(x, s, c); }
[ppc64le] /usr/src/RPM/BUILD/libopencv-4.11.0/modules/core/include/opencv2/core/hal/intrin_math.hpp:542:45: error: 'v_ne' was not declared in this scope
[ppc64le]   542 |     _TpVec32F mask_nan = v_or(mask_inf, v_ne(x, x));
[ppc64le] --
[ppc64le]  1609 | inline void v_sincos(const v_float64x2& x, v_float64x2& s, v_float64x2& c) { v_sincos_default_64f<v_float64x2, v_int64x2>(x, s, c); }
[ppc64le] /usr/src/RPM/BUILD/libopencv-4.11.0/modules/core/include/opencv2/core/hal/intrin_math.hpp:629:45: error: 'v_ne' was not declared in this scope
[ppc64le]   629 |     _TpVec64F mask_nan = v_or(mask_inf, v_ne(x, x));
2025-Mar-05 08:32:41 :: [ppc64le] libopencv.git 4.11.0-alt1: remote: build failed
2025-Mar-05 08:32:41 :: [ppc64le] #100 libopencv.git 4.11.0-alt1: build FAILED
2025-Mar-05 08:32:41 :: [ppc64le] requesting cancellation of task processing
2025-Mar-05 08:46:39 :: [x86_64] #100 libopencv.git 4.11.0-alt1: build OK
2025-Mar-05 08:50:16 :: [i586] #100 libopencv.git 4.11.0-alt1: build OK
[aarch64] + LD_LIBRARY_PATH=/usr/src/tmp/libopencv-buildroot/usr/lib64:
[aarch64] + python3 -
[aarch64] + sort -u
[aarch64] + sort /usr/src/RPM/SOURCES/expected_mods_ppc64le_aarch64.list
[aarch64] + diff -y expected_mods.list actual_mods.list
[aarch64] malloc(): corrupted top size
[aarch64] /usr/src/tmp/rpm-tmp.60704: line 167: 2175832 Aborted                 diff -y expected_mods.list actual_mods.list
[aarch64] + echo 'Update expected list of modules'
[aarch64] Update expected list of modules
[aarch64] + exit 1
2025-Mar-05 08:58:37 :: [aarch64] libopencv.git 4.11.0-alt1: remote: build failed
2025-Mar-05 08:58:37 :: [aarch64] #100 libopencv.git 4.11.0-alt1: build FAILED
2025-Mar-05 08:32:41 :: [ppc64le] build FAILED
2025-Mar-05 08:58:38 :: [aarch64] build FAILED
2025-Mar-05 08:58:38 :: task #376898 for sisyphus FAILED


More information about the Sisyphus-incominger mailing list