[#376820] [test-only] FAILED (try 3) diun.git=4.29.0-alt1
Girar awaiter (fedor)
girar-builder at altlinux.org
Tue Mar 4 22:03:18 MSK 2025
https://git.altlinux.org/tasks/376820/logs/events.3.1.log
https://packages.altlinux.org/tasks/376820
subtask name aarch64 i586 ppc64le x86_64
#300 diun failed failed failed failed
2025-Mar-04 19:00:23 :: test-only task #376820 for sisyphus resumed by fedor:
#100 removed
#200 removed
#300 build 4.29.0-alt1 from /people/fedor/packages/diun.git fetched at 2025-Mar-04 18:59:53
2025-Mar-04 19:00:25 :: [x86_64] #300 diun.git 4.29.0-alt1: build start
2025-Mar-04 19:00:25 :: [i586] #300 diun.git 4.29.0-alt1: build start
2025-Mar-04 19:00:25 :: [aarch64] #300 diun.git 4.29.0-alt1: build start
2025-Mar-04 19:00:25 :: [ppc64le] #300 diun.git 4.29.0-alt1: build start
[x86_64] Processing files: diun-4.29.0-alt1
[x86_64] error: No such file or directory: /usr/src/tmp/diun-buildroot/usr/bin/diun
[x86_64] Executing(%doc): /bin/sh -e /usr/src/tmp/rpm-tmp.71437
[x86_64] --
[x86_64] RPM build errors:
[x86_64] No such file or directory: /usr/src/tmp/diun-buildroot/usr/bin/diun
2025-Mar-04 19:01:53 :: [x86_64] diun.git 4.29.0-alt1: remote: build failed
2025-Mar-04 19:01:53 :: [x86_64] #300 diun.git 4.29.0-alt1: build FAILED
2025-Mar-04 19:01:53 :: [x86_64] requesting cancellation of task processing
[i586] Processing files: diun-4.29.0-alt1
[i586] error: No such file or directory: /usr/src/tmp/diun-buildroot/usr/bin/diun
[i586] Executing(%doc): /bin/sh -e /usr/src/tmp/rpm-tmp.77960
[i586] --
[i586] RPM build errors:
[i586] No such file or directory: /usr/src/tmp/diun-buildroot/usr/bin/diun
2025-Mar-04 19:01:55 :: [i586] diun.git 4.29.0-alt1: remote: build failed
2025-Mar-04 19:01:55 :: [i586] #300 diun.git 4.29.0-alt1: build FAILED
[aarch64] Processing files: diun-4.29.0-alt1
[aarch64] error: No such file or directory: /usr/src/tmp/diun-buildroot/usr/bin/diun
[aarch64] Executing(%doc): /bin/sh -e /usr/src/tmp/rpm-tmp.23948
[aarch64] --
[aarch64] RPM build errors:
[aarch64] No such file or directory: /usr/src/tmp/diun-buildroot/usr/bin/diun
2025-Mar-04 19:02:46 :: [aarch64] diun.git 4.29.0-alt1: remote: build failed
2025-Mar-04 19:02:46 :: [aarch64] #300 diun.git 4.29.0-alt1: build FAILED
[ppc64le] Processing files: diun-4.29.0-alt1
[ppc64le] error: No such file or directory: /usr/src/tmp/diun-buildroot/usr/bin/diun
[ppc64le] Executing(%doc): /bin/sh -e /usr/src/tmp/rpm-tmp.19204
[ppc64le] --
[ppc64le] RPM build errors:
[ppc64le] No such file or directory: /usr/src/tmp/diun-buildroot/usr/bin/diun
2025-Mar-04 19:03:18 :: [ppc64le] diun.git 4.29.0-alt1: remote: build failed
2025-Mar-04 19:03:18 :: [ppc64le] #300 diun.git 4.29.0-alt1: build FAILED
2025-Mar-04 19:01:53 :: [x86_64] build FAILED
2025-Mar-04 19:01:55 :: [i586] build FAILED
2025-Mar-04 19:02:47 :: [aarch64] build FAILED
2025-Mar-04 19:03:18 :: [ppc64le] build FAILED
2025-Mar-04 19:03:18 :: task #376820 for sisyphus FAILED
More information about the Sisyphus-incominger
mailing list