[#372004] FAILED (try 21) cloud-init.git=24.4.1-alt1

Girar awaiter (fedor) girar-builder at altlinux.org
Tue Mar 4 14:41:33 MSK 2025


https://git.altlinux.org/tasks/372004/logs/events.21.1.log
https://packages.altlinux.org/tasks/372004

subtask  name        aarch64    i586  ppc64le  x86_64
  #2700  cloud-init   failed  failed   failed  failed

2025-Mar-04 11:41:09 :: task #372004 for sisyphus resumed by fedor:
#100 removed
#200 removed
#300 removed
#400 removed
#500 removed
#600 removed
#700 removed
#1000 removed
#1100 removed
#1200 removed
#1300 removed
#1400 removed
#1500 removed
#1600 removed
#1700 removed
#2000 removed
#2100 removed
#2200 removed
#2300 removed
#2400 removed
#2500 removed
#2600 removed
#2700 build 24.4.1-alt1 from /people/fedor/packages/cloud-init.git fetched at 2025-Mar-04 11:40:38
2025-Mar-04 11:41:11 :: [ppc64le] #2700 cloud-init.git 24.4.1-alt1: build start
2025-Mar-04 11:41:11 :: [x86_64] #2700 cloud-init.git 24.4.1-alt1: build start
2025-Mar-04 11:41:11 :: [i586] #2700 cloud-init.git 24.4.1-alt1: build start
2025-Mar-04 11:41:11 :: [aarch64] #2700 cloud-init.git 24.4.1-alt1: build start
[i586] <13>Mar  4 11:41:22 rpmi: libmpdec3-2.5.1-alt3 sisyphus+314490.500.5.1 1675432033 installed
[i586] <13>Mar  4 11:41:22 rpmi: libgdbm-1.8.3-alt10 sisyphus+346222.200.3.2 1716468406 installed
[i586] <13>Mar  4 11:41:22 rpmi: libexpat-2.6.4-alt1 sisyphus+365521.100.1.1 1734700247 installed
[i586] <13>Mar  4 11:41:22 rpmi: openssl-config-3.2.0-alt1 sisyphus+366659.140.4.1 1736956949 installed
[i586] <13>Mar  4 11:41:22 rpmi: libb2-0.98.1-alt1_1 sisyphus+291614.100.1.1 1638962878 installed
[i586] <13>Mar  4 11:41:22 rpmi: libp11-kit-1:0.25.5-alt1 sisyphus+352553.100.1.1 1720622586 installed
[i586] <13>Mar  4 11:41:22 rpmi: libtasn1-4.20.0-alt2 sisyphus+375829.100.1.1 1740299335 installed
[i586] <13>Mar  4 11:41:22 rpmi: rpm-macros-alternatives-0.5.3-alt1 sisyphus+371878.100.1.1 1737988822 installed
[i586] <13>Mar  4 11:41:22 rpmi: alternatives-0.5.3-alt1 sisyphus+371878.100.1.1 1737988822 installed
[i586] <13>Mar  4 11:41:22 rpmi: ca-certificates-2025.02.10-alt1 sisyphus+374228.100.4.1 1739265441 installed
[i586] <13>Mar  4 11:41:22 rpmi: ca-trust-0.2.0-alt1 sisyphus+344843.100.1.1 1712743326 installed
[i586] <13>Mar  4 11:41:22 rpmi: p11-kit-trust-1:0.25.5-alt1 sisyphus+352553.100.1.1 1720622586 installed
[i586] <13>Mar  4 11:41:22 rpmi: libcrypto3-3.3.3-alt1 sisyphus+374381.40.2.1 1739299702 installed
[i586] <13>Mar  4 11:41:22 rpmi: libssl3-3.3.3-alt1 sisyphus+374381.40.2.1 1739299702 installed
[i586] <13>Mar  4 11:41:22 rpmi: python3-3.12.9-alt1 sisyphus+376344.100.1.1 1740742068 installed
[i586] <13>Mar  4 11:41:22 rpmi: python3-base-3.12.9-alt1 sisyphus+376344.100.1.1 1740742068 installed
[i586] <13>Mar  4 11:41:22 rpmi: python3-module-py3dephell-0.3.1-alt1 sisyphus+365261.200.1.1 1734463433 installed
[i586] <13>Mar  4 11:41:22 rpmi: tests-for-installed-python3-pkgs-0.1.28-alt1 sisyphus+375953.100.2.1 1740855713 installed
[i586] <13>Mar  4 11:41:22 rpmi: rpm-build-python3-0.1.28-alt1 sisyphus+375953.100.2.1 1740855713 installed
[i586] WARNING: %python3_build is deprecated and will be removed in future, please use %pyproject_build instead
[i586] WARNING: %python3_install is deprecated and will be removed in future, please use %pyproject_install instead
[i586] error: line 208: triggers must have --: %triggerin
[i586] 
[i586] hsh-rebuild: pkg.tar: failed to fetch build dependencies.
2025-Mar-04 11:41:23 :: [i586] cloud-init.git 24.4.1-alt1: remote: cannot build src.rpm
2025-Mar-04 11:41:23 :: [i586] #2700 cloud-init.git 24.4.1-alt1: build FAILED
2025-Mar-04 11:41:23 :: [i586] requesting cancellation of task processing
[x86_64] <13>Mar  4 11:41:22 rpmi: libmpdec3-2.5.1-alt3 sisyphus+314490.500.5.1 1675432004 installed
[x86_64] <13>Mar  4 11:41:22 rpmi: libgdbm-1.8.3-alt10 sisyphus+346222.200.3.2 1716468404 installed
[x86_64] <13>Mar  4 11:41:22 rpmi: libexpat-2.6.4-alt1 sisyphus+365521.100.1.1 1734700243 installed
[x86_64] <13>Mar  4 11:41:22 rpmi: openssl-config-3.2.0-alt1 sisyphus+366659.140.4.1 1736956949 installed
[x86_64] <13>Mar  4 11:41:22 rpmi: libb2-0.98.1-alt1_1 sisyphus+291614.100.1.1 1638962877 installed
[x86_64] <13>Mar  4 11:41:22 rpmi: libp11-kit-1:0.25.5-alt1 sisyphus+352553.100.1.1 1720622573 installed
[x86_64] <13>Mar  4 11:41:22 rpmi: libtasn1-4.20.0-alt2 sisyphus+375829.100.1.1 1740299335 installed
[x86_64] <13>Mar  4 11:41:22 rpmi: rpm-macros-alternatives-0.5.3-alt1 sisyphus+371878.100.1.1 1737988822 installed
[x86_64] <13>Mar  4 11:41:22 rpmi: alternatives-0.5.3-alt1 sisyphus+371878.100.1.1 1737988822 installed
[x86_64] <13>Mar  4 11:41:22 rpmi: ca-certificates-2025.02.10-alt1 sisyphus+374228.100.4.1 1739265441 installed
[x86_64] <13>Mar  4 11:41:22 rpmi: ca-trust-0.2.0-alt1 sisyphus+344843.100.1.1 1712743326 installed
[x86_64] <13>Mar  4 11:41:22 rpmi: p11-kit-trust-1:0.25.5-alt1 sisyphus+352553.100.1.1 1720622573 installed
[x86_64] <13>Mar  4 11:41:22 rpmi: libcrypto3-3.3.3-alt1 sisyphus+374381.40.2.1 1739299401 installed
[x86_64] <13>Mar  4 11:41:22 rpmi: libssl3-3.3.3-alt1 sisyphus+374381.40.2.1 1739299401 installed
[x86_64] <13>Mar  4 11:41:22 rpmi: python3-3.12.9-alt1 sisyphus+376344.100.1.1 1740741913 installed
[x86_64] <13>Mar  4 11:41:23 rpmi: python3-base-3.12.9-alt1 sisyphus+376344.100.1.1 1740741913 installed
[x86_64] <13>Mar  4 11:41:23 rpmi: python3-module-py3dephell-0.3.1-alt1 sisyphus+365261.200.1.1 1734463433 installed
[x86_64] <13>Mar  4 11:41:23 rpmi: tests-for-installed-python3-pkgs-0.1.28-alt1 sisyphus+375953.100.2.1 1740855713 installed
[x86_64] <13>Mar  4 11:41:23 rpmi: rpm-build-python3-0.1.28-alt1 sisyphus+375953.100.2.1 1740855713 installed
[x86_64] WARNING: %python3_build is deprecated and will be removed in future, please use %pyproject_build instead
[x86_64] WARNING: %python3_install is deprecated and will be removed in future, please use %pyproject_install instead
[x86_64] error: line 208: triggers must have --: %triggerin
[x86_64] 
[x86_64] hsh-rebuild: pkg.tar: failed to fetch build dependencies.
2025-Mar-04 11:41:23 :: [x86_64] cloud-init.git 24.4.1-alt1: remote: cannot build src.rpm
2025-Mar-04 11:41:23 :: [x86_64] #2700 cloud-init.git 24.4.1-alt1: build FAILED
[aarch64] <13>Mar  4 11:41:29 rpmi: libmpdec3-2.5.1-alt3 sisyphus+314490.500.5.1 1675432086 installed
[aarch64] <13>Mar  4 11:41:29 rpmi: libgdbm-1.8.3-alt10 sisyphus+346222.200.3.2 1716468418 installed
[aarch64] <13>Mar  4 11:41:29 rpmi: libexpat-2.6.4-alt1 sisyphus+365521.100.1.1 1734700274 installed
[aarch64] <13>Mar  4 11:41:29 rpmi: openssl-config-3.2.0-alt1 sisyphus+366659.140.4.1 1736956949 installed
[aarch64] <13>Mar  4 11:41:29 rpmi: libb2-0.98.1-alt1_1 sisyphus+291614.100.1.1 1638962893 installed
[aarch64] <13>Mar  4 11:41:29 rpmi: libp11-kit-1:0.25.5-alt1 sisyphus+352553.100.1.1 1720622713 installed
[aarch64] <13>Mar  4 11:41:29 rpmi: libtasn1-4.20.0-alt2 sisyphus+375829.100.1.1 1740299365 installed
[aarch64] <13>Mar  4 11:41:29 rpmi: rpm-macros-alternatives-0.5.3-alt1 sisyphus+371878.100.1.1 1737988822 installed
[aarch64] <13>Mar  4 11:41:29 rpmi: alternatives-0.5.3-alt1 sisyphus+371878.100.1.1 1737988822 installed
[aarch64] <13>Mar  4 11:41:29 rpmi: ca-certificates-2025.02.10-alt1 sisyphus+374228.100.4.1 1739265441 installed
[aarch64] <13>Mar  4 11:41:29 rpmi: ca-trust-0.2.0-alt1 sisyphus+344843.100.1.1 1712743326 installed
[aarch64] <13>Mar  4 11:41:29 rpmi: p11-kit-trust-1:0.25.5-alt1 sisyphus+352553.100.1.1 1720622713 installed
[aarch64] <13>Mar  4 11:41:29 rpmi: libcrypto3-3.3.3-alt1 sisyphus+374381.40.2.1 1739300002 installed
[aarch64] <13>Mar  4 11:41:29 rpmi: libssl3-3.3.3-alt1 sisyphus+374381.40.2.1 1739300002 installed
[aarch64] <13>Mar  4 11:41:29 rpmi: python3-3.12.9-alt1 sisyphus+376344.100.1.1 1740743731 installed
[aarch64] <13>Mar  4 11:41:30 rpmi: python3-base-3.12.9-alt1 sisyphus+376344.100.1.1 1740743731 installed
[aarch64] <13>Mar  4 11:41:30 rpmi: python3-module-py3dephell-0.3.1-alt1 sisyphus+365261.200.1.1 1734463433 installed
[aarch64] <13>Mar  4 11:41:30 rpmi: tests-for-installed-python3-pkgs-0.1.28-alt1 sisyphus+375953.100.2.1 1740855713 installed
[aarch64] <13>Mar  4 11:41:30 rpmi: rpm-build-python3-0.1.28-alt1 sisyphus+375953.100.2.1 1740855713 installed
[aarch64] WARNING: %python3_build is deprecated and will be removed in future, please use %pyproject_build instead
[aarch64] WARNING: %python3_install is deprecated and will be removed in future, please use %pyproject_install instead
[aarch64] error: line 208: triggers must have --: %triggerin
[aarch64] 
[aarch64] hsh-rebuild: pkg.tar: failed to fetch build dependencies.
2025-Mar-04 11:41:31 :: [aarch64] cloud-init.git 24.4.1-alt1: remote: cannot build src.rpm
2025-Mar-04 11:41:31 :: [aarch64] #2700 cloud-init.git 24.4.1-alt1: build FAILED
[ppc64le] <13>Mar  4 11:41:31 rpmi: libmpdec3-2.5.1-alt3 sisyphus+314490.500.5.1 1675432129 installed
[ppc64le] <13>Mar  4 11:41:31 rpmi: libgdbm-1.8.3-alt10 sisyphus+346222.200.3.2 1716468420 installed
[ppc64le] <13>Mar  4 11:41:31 rpmi: libexpat-2.6.4-alt1 sisyphus+365521.100.1.1 1734700307 installed
[ppc64le] <13>Mar  4 11:41:31 rpmi: openssl-config-3.2.0-alt1 sisyphus+366659.140.4.1 1736956949 installed
[ppc64le] <13>Mar  4 11:41:31 rpmi: libb2-0.98.1-alt1_1 sisyphus+291614.100.1.1 1638962899 installed
[ppc64le] <13>Mar  4 11:41:31 rpmi: libp11-kit-1:0.25.5-alt1 sisyphus+352553.100.1.1 1720622748 installed
[ppc64le] <13>Mar  4 11:41:31 rpmi: libtasn1-4.20.0-alt2 sisyphus+375829.100.1.1 1740299386 installed
[ppc64le] <13>Mar  4 11:41:31 rpmi: rpm-macros-alternatives-0.5.3-alt1 sisyphus+371878.100.1.1 1737988822 installed
[ppc64le] <13>Mar  4 11:41:31 rpmi: alternatives-0.5.3-alt1 sisyphus+371878.100.1.1 1737988822 installed
[ppc64le] <13>Mar  4 11:41:31 rpmi: ca-certificates-2025.02.10-alt1 sisyphus+374228.100.4.1 1739265441 installed
[ppc64le] <13>Mar  4 11:41:31 rpmi: ca-trust-0.2.0-alt1 sisyphus+344843.100.1.1 1712743326 installed
[ppc64le] <13>Mar  4 11:41:31 rpmi: p11-kit-trust-1:0.25.5-alt1 sisyphus+352553.100.1.1 1720622748 installed
[ppc64le] <13>Mar  4 11:41:31 rpmi: libcrypto3-3.3.3-alt1 sisyphus+374381.40.2.1 1739300078 installed
[ppc64le] <13>Mar  4 11:41:31 rpmi: libssl3-3.3.3-alt1 sisyphus+374381.40.2.1 1739300078 installed
[ppc64le] <13>Mar  4 11:41:31 rpmi: python3-3.12.9-alt1 sisyphus+376344.100.1.1 1740744012 installed
[ppc64le] <13>Mar  4 11:41:32 rpmi: python3-base-3.12.9-alt1 sisyphus+376344.100.1.1 1740744012 installed
[ppc64le] <13>Mar  4 11:41:32 rpmi: python3-module-py3dephell-0.3.1-alt1 sisyphus+365261.200.1.1 1734463433 installed
[ppc64le] <13>Mar  4 11:41:32 rpmi: tests-for-installed-python3-pkgs-0.1.28-alt1 sisyphus+375953.100.2.1 1740855713 installed
[ppc64le] <13>Mar  4 11:41:32 rpmi: rpm-build-python3-0.1.28-alt1 sisyphus+375953.100.2.1 1740855713 installed
[ppc64le] WARNING: %python3_build is deprecated and will be removed in future, please use %pyproject_build instead
[ppc64le] WARNING: %python3_install is deprecated and will be removed in future, please use %pyproject_install instead
[ppc64le] error: line 208: triggers must have --: %triggerin
[ppc64le] 
[ppc64le] hsh-rebuild: pkg.tar: failed to fetch build dependencies.
2025-Mar-04 11:41:33 :: [ppc64le] cloud-init.git 24.4.1-alt1: remote: cannot build src.rpm
2025-Mar-04 11:41:33 :: [ppc64le] #2700 cloud-init.git 24.4.1-alt1: build FAILED
2025-Mar-04 11:41:23 :: [i586] build FAILED
2025-Mar-04 11:41:23 :: [x86_64] build FAILED
2025-Mar-04 11:41:31 :: [aarch64] build FAILED
2025-Mar-04 11:41:33 :: [ppc64le] build FAILED
2025-Mar-04 11:41:33 :: task #372004 for sisyphus FAILED


More information about the Sisyphus-incominger mailing list