[#376788] [test-only] FAILED deepin-calculator.git=6.5.8-alt1
Girar awaiter (lvol)
girar-builder at altlinux.org
Tue Mar 4 12:55:03 MSK 2025
https://git.altlinux.org/tasks/376788/logs/events.1.1.log
https://packages.altlinux.org/tasks/376788
subtask name aarch64 i586 ppc64le x86_64
#100 deepin-calculator failed failed failed failed
2025-Mar-04 09:53:08 :: test-only task #376788 for sisyphus started by lvol:
#100 build 6.5.8-alt1 from /people/lvol/packages/deepin-calculator.git fetched at 2025-Mar-04 09:52:23
2025-Mar-04 09:53:10 :: [x86_64] #100 deepin-calculator.git 6.5.8-alt1: build start
2025-Mar-04 09:53:10 :: [i586] #100 deepin-calculator.git 6.5.8-alt1: build start
2025-Mar-04 09:53:10 :: [aarch64] #100 deepin-calculator.git 6.5.8-alt1: build start
2025-Mar-04 09:53:10 :: [ppc64le] #100 deepin-calculator.git 6.5.8-alt1: build start
[x86_64] Processing files: deepin-calculator-6.5.8-alt1
[x86_64] error: No such file or directory: /usr/src/tmp/deepin-calculator-buildroot/usr/share/deepin-calculator
[x86_64] Executing(%doc): /bin/sh -e /usr/src/tmp/rpm-tmp.64779
[x86_64] --
[x86_64] RPM build errors:
[x86_64] No such file or directory: /usr/src/tmp/deepin-calculator-buildroot/usr/share/deepin-calculator
2025-Mar-04 09:53:59 :: [x86_64] deepin-calculator.git 6.5.8-alt1: remote: build failed
2025-Mar-04 09:53:59 :: [x86_64] #100 deepin-calculator.git 6.5.8-alt1: build FAILED
2025-Mar-04 09:53:59 :: [x86_64] requesting cancellation of task processing
[i586] Processing files: deepin-calculator-6.5.8-alt1
[i586] error: No such file or directory: /usr/src/tmp/deepin-calculator-buildroot/usr/share/deepin-calculator
[i586] Executing(%doc): /bin/sh -e /usr/src/tmp/rpm-tmp.45090
[i586] --
[i586] RPM build errors:
[i586] No such file or directory: /usr/src/tmp/deepin-calculator-buildroot/usr/share/deepin-calculator
2025-Mar-04 09:54:02 :: [i586] deepin-calculator.git 6.5.8-alt1: remote: build failed
2025-Mar-04 09:54:02 :: [i586] #100 deepin-calculator.git 6.5.8-alt1: build FAILED
[ppc64le] Processing files: deepin-calculator-6.5.8-alt1
[ppc64le] error: No such file or directory: /usr/src/tmp/deepin-calculator-buildroot/usr/share/deepin-calculator
[ppc64le] Executing(%doc): /bin/sh -e /usr/src/tmp/rpm-tmp.16222
[ppc64le] --
[ppc64le] RPM build errors:
[ppc64le] No such file or directory: /usr/src/tmp/deepin-calculator-buildroot/usr/share/deepin-calculator
2025-Mar-04 09:54:59 :: [ppc64le] deepin-calculator.git 6.5.8-alt1: remote: build failed
2025-Mar-04 09:54:59 :: [ppc64le] #100 deepin-calculator.git 6.5.8-alt1: build FAILED
[aarch64] Processing files: deepin-calculator-6.5.8-alt1
[aarch64] error: No such file or directory: /usr/src/tmp/deepin-calculator-buildroot/usr/share/deepin-calculator
[aarch64] Executing(%doc): /bin/sh -e /usr/src/tmp/rpm-tmp.59947
[aarch64] --
[aarch64] RPM build errors:
[aarch64] No such file or directory: /usr/src/tmp/deepin-calculator-buildroot/usr/share/deepin-calculator
2025-Mar-04 09:55:03 :: [aarch64] deepin-calculator.git 6.5.8-alt1: remote: build failed
2025-Mar-04 09:55:03 :: [aarch64] #100 deepin-calculator.git 6.5.8-alt1: build FAILED
2025-Mar-04 09:54:00 :: [x86_64] build FAILED
2025-Mar-04 09:54:02 :: [i586] build FAILED
2025-Mar-04 09:54:59 :: [ppc64le] build FAILED
2025-Mar-04 09:55:03 :: [aarch64] build FAILED
2025-Mar-04 09:55:03 :: task #376788 for sisyphus FAILED
More information about the Sisyphus-incominger
mailing list