[#375221] [test-only] FAILED (try 17) srpm=cdi-api-2.0.2-alt2.src.rpm srpm=junit5-5.10.2-alt1.src.rpm ...
Girar awaiter (cas)
girar-builder at altlinux.org
Tue Mar 4 12:46:22 MSK 2025
https://git.altlinux.org/tasks/375221/logs/events.17.1.log
https://packages.altlinux.org/tasks/375221
subtask name aarch64 i586 ppc64le x86_64
#1000 infinispan failed failed failed failed
2025-Mar-04 09:33:37 :: test-only task #375221 for sisyphus resumed by cas:
#100 build cdi-api-2.0.2-alt2.src.rpm
#200 build junit5-5.10.2-alt1.src.rpm
#220 build plexus-pom-20-alt1.src.rpm
#230 build plexus-compiler-2.15.0-alt1.src.rpm
#240 removed
#300 build maven-parent-36-alt1.src.rpm
#340 removed
#350 build maven-compiler-plugin-3.12.1-alt1.src.rpm
#352 build objectweb-asm-9.7.1-alt1.src.rpm
#353 build plexus-utils-3.6.0-alt1.src.rpm
#354 build maven-plugin-tools-3.9.0-alt1.src.rpm
#360 removed
#364 build maven-surefire-3.0.0_M9-alt1.src.rpm
#370 removed
#400 removed
#500 removed
#600 removed
#700 removed
#1000 build 14.0.1-alt1 from /people/cas/packages/infinispan.git fetched at 2025-Mar-04 09:30:14
2025-Mar-04 09:33:39 :: created build repo
2025-Mar-04 09:33:40 :: [aarch64] #100 cdi-api-2.0.2-alt2.src.rpm: build start
2025-Mar-04 09:33:40 :: [i586] #100 cdi-api-2.0.2-alt2.src.rpm: build start
2025-Mar-04 09:33:40 :: [ppc64le] #100 cdi-api-2.0.2-alt2.src.rpm: build start
2025-Mar-04 09:33:40 :: [x86_64] #100 cdi-api-2.0.2-alt2.src.rpm: build start
2025-Mar-04 09:33:58 :: [i586] #100 cdi-api-2.0.2-alt2.src.rpm: build OK (cached)
2025-Mar-04 09:33:58 :: [i586] #200 junit5-5.10.2-alt1.src.rpm: build start
2025-Mar-04 09:33:58 :: [x86_64] #100 cdi-api-2.0.2-alt2.src.rpm: build OK (cached)
2025-Mar-04 09:33:59 :: [x86_64] #200 junit5-5.10.2-alt1.src.rpm: build start
2025-Mar-04 09:34:12 :: [i586] #200 junit5-5.10.2-alt1.src.rpm: build OK (cached)
2025-Mar-04 09:34:12 :: [i586] #220 plexus-pom-20-alt1.src.rpm: build start
2025-Mar-04 09:34:13 :: [x86_64] #200 junit5-5.10.2-alt1.src.rpm: build OK (cached)
2025-Mar-04 09:34:13 :: [x86_64] #220 plexus-pom-20-alt1.src.rpm: build start
2025-Mar-04 09:34:17 :: [aarch64] #100 cdi-api-2.0.2-alt2.src.rpm: build OK (cached)
2025-Mar-04 09:34:17 :: [aarch64] #200 junit5-5.10.2-alt1.src.rpm: build start
2025-Mar-04 09:34:25 :: [i586] #220 plexus-pom-20-alt1.src.rpm: build OK (cached)
2025-Mar-04 09:34:25 :: [i586] #230 plexus-compiler-2.15.0-alt1.src.rpm: build start
2025-Mar-04 09:34:26 :: [ppc64le] #100 cdi-api-2.0.2-alt2.src.rpm: build OK (cached)
2025-Mar-04 09:34:27 :: [x86_64] #220 plexus-pom-20-alt1.src.rpm: build OK (cached)
2025-Mar-04 09:34:27 :: [ppc64le] #200 junit5-5.10.2-alt1.src.rpm: build start
2025-Mar-04 09:34:27 :: [x86_64] #230 plexus-compiler-2.15.0-alt1.src.rpm: build start
2025-Mar-04 09:34:39 :: [i586] #230 plexus-compiler-2.15.0-alt1.src.rpm: build OK (cached)
2025-Mar-04 09:34:39 :: [i586] #300 maven-parent-36-alt1.src.rpm: build start
2025-Mar-04 09:34:41 :: [x86_64] #230 plexus-compiler-2.15.0-alt1.src.rpm: build OK (cached)
2025-Mar-04 09:34:41 :: [x86_64] #300 maven-parent-36-alt1.src.rpm: build start
2025-Mar-04 09:34:44 :: [aarch64] #200 junit5-5.10.2-alt1.src.rpm: build OK (cached)
2025-Mar-04 09:34:45 :: [aarch64] #220 plexus-pom-20-alt1.src.rpm: build start
2025-Mar-04 09:34:52 :: [i586] #300 maven-parent-36-alt1.src.rpm: build OK (cached)
2025-Mar-04 09:34:52 :: [i586] #350 maven-compiler-plugin-3.12.1-alt1.src.rpm: build start
2025-Mar-04 09:34:55 :: [x86_64] #300 maven-parent-36-alt1.src.rpm: build OK (cached)
2025-Mar-04 09:34:55 :: [x86_64] #350 maven-compiler-plugin-3.12.1-alt1.src.rpm: build start
2025-Mar-04 09:34:56 :: [ppc64le] #200 junit5-5.10.2-alt1.src.rpm: build OK (cached)
2025-Mar-04 09:34:56 :: [ppc64le] #220 plexus-pom-20-alt1.src.rpm: build start
2025-Mar-04 09:35:07 :: [i586] #350 maven-compiler-plugin-3.12.1-alt1.src.rpm: build OK (cached)
2025-Mar-04 09:35:07 :: [i586] #352 objectweb-asm-9.7.1-alt1.src.rpm: build start
2025-Mar-04 09:35:10 :: [aarch64] #220 plexus-pom-20-alt1.src.rpm: build OK (cached)
2025-Mar-04 09:35:10 :: [aarch64] #230 plexus-compiler-2.15.0-alt1.src.rpm: build start
2025-Mar-04 09:35:10 :: [x86_64] #350 maven-compiler-plugin-3.12.1-alt1.src.rpm: build OK (cached)
2025-Mar-04 09:35:10 :: [x86_64] #352 objectweb-asm-9.7.1-alt1.src.rpm: build start
2025-Mar-04 09:35:20 :: [i586] #352 objectweb-asm-9.7.1-alt1.src.rpm: build OK (cached)
2025-Mar-04 09:35:20 :: [i586] #353 plexus-utils-3.6.0-alt1.src.rpm: build start
2025-Mar-04 09:35:22 :: [ppc64le] #220 plexus-pom-20-alt1.src.rpm: build OK (cached)
2025-Mar-04 09:35:22 :: [ppc64le] #230 plexus-compiler-2.15.0-alt1.src.rpm: build start
2025-Mar-04 09:35:24 :: [x86_64] #352 objectweb-asm-9.7.1-alt1.src.rpm: build OK (cached)
2025-Mar-04 09:35:24 :: [x86_64] #353 plexus-utils-3.6.0-alt1.src.rpm: build start
2025-Mar-04 09:35:34 :: [i586] #353 plexus-utils-3.6.0-alt1.src.rpm: build OK (cached)
2025-Mar-04 09:35:34 :: [i586] #354 maven-plugin-tools-3.9.0-alt1.src.rpm: build start
2025-Mar-04 09:35:38 :: [aarch64] #230 plexus-compiler-2.15.0-alt1.src.rpm: build OK (cached)
2025-Mar-04 09:35:38 :: [aarch64] #300 maven-parent-36-alt1.src.rpm: build start
2025-Mar-04 09:35:38 :: [x86_64] #353 plexus-utils-3.6.0-alt1.src.rpm: build OK (cached)
2025-Mar-04 09:35:38 :: [x86_64] #354 maven-plugin-tools-3.9.0-alt1.src.rpm: build start
2025-Mar-04 09:35:49 :: [i586] #354 maven-plugin-tools-3.9.0-alt1.src.rpm: build OK (cached)
2025-Mar-04 09:35:49 :: [ppc64le] #230 plexus-compiler-2.15.0-alt1.src.rpm: build OK (cached)
2025-Mar-04 09:35:49 :: [i586] #364 maven-surefire-3.0.0_M9-alt1.src.rpm: build start
2025-Mar-04 09:35:49 :: [ppc64le] #300 maven-parent-36-alt1.src.rpm: build start
2025-Mar-04 09:35:53 :: [x86_64] #354 maven-plugin-tools-3.9.0-alt1.src.rpm: build OK (cached)
2025-Mar-04 09:35:54 :: [x86_64] #364 maven-surefire-3.0.0_M9-alt1.src.rpm: build start
2025-Mar-04 09:36:03 :: [i586] #364 maven-surefire-3.0.0_M9-alt1.src.rpm: build OK (cached)
2025-Mar-04 09:36:04 :: [i586] #1000 infinispan.git 14.0.1-alt1: build start
2025-Mar-04 09:36:04 :: [aarch64] #300 maven-parent-36-alt1.src.rpm: build OK (cached)
2025-Mar-04 09:36:05 :: [aarch64] #350 maven-compiler-plugin-3.12.1-alt1.src.rpm: build start
2025-Mar-04 09:36:09 :: [x86_64] #364 maven-surefire-3.0.0_M9-alt1.src.rpm: build OK (cached)
2025-Mar-04 09:36:09 :: [x86_64] #1000 infinispan.git 14.0.1-alt1: build start
2025-Mar-04 09:36:17 :: [ppc64le] #300 maven-parent-36-alt1.src.rpm: build OK (cached)
2025-Mar-04 09:36:17 :: [ppc64le] #350 maven-compiler-plugin-3.12.1-alt1.src.rpm: build start
2025-Mar-04 09:36:34 :: [aarch64] #350 maven-compiler-plugin-3.12.1-alt1.src.rpm: build OK (cached)
2025-Mar-04 09:36:34 :: [aarch64] #352 objectweb-asm-9.7.1-alt1.src.rpm: build start
2025-Mar-04 09:36:48 :: [ppc64le] #350 maven-compiler-plugin-3.12.1-alt1.src.rpm: build OK (cached)
2025-Mar-04 09:36:49 :: [ppc64le] #352 objectweb-asm-9.7.1-alt1.src.rpm: build start
2025-Mar-04 09:37:00 :: [aarch64] #352 objectweb-asm-9.7.1-alt1.src.rpm: build OK (cached)
2025-Mar-04 09:37:00 :: [aarch64] #353 plexus-utils-3.6.0-alt1.src.rpm: build start
2025-Mar-04 09:37:14 :: [ppc64le] #352 objectweb-asm-9.7.1-alt1.src.rpm: build OK (cached)
2025-Mar-04 09:37:15 :: [ppc64le] #353 plexus-utils-3.6.0-alt1.src.rpm: build start
2025-Mar-04 09:37:28 :: [aarch64] #353 plexus-utils-3.6.0-alt1.src.rpm: build OK (cached)
2025-Mar-04 09:37:29 :: [aarch64] #354 maven-plugin-tools-3.9.0-alt1.src.rpm: build start
2025-Mar-04 09:37:41 :: [ppc64le] #353 plexus-utils-3.6.0-alt1.src.rpm: build OK (cached)
2025-Mar-04 09:37:42 :: [ppc64le] #354 maven-plugin-tools-3.9.0-alt1.src.rpm: build start
2025-Mar-04 09:38:04 :: [aarch64] #354 maven-plugin-tools-3.9.0-alt1.src.rpm: build OK (cached)
2025-Mar-04 09:38:04 :: [aarch64] #364 maven-surefire-3.0.0_M9-alt1.src.rpm: build start
2025-Mar-04 09:38:12 :: [ppc64le] #354 maven-plugin-tools-3.9.0-alt1.src.rpm: build OK (cached)
2025-Mar-04 09:38:12 :: [ppc64le] #364 maven-surefire-3.0.0_M9-alt1.src.rpm: build start
2025-Mar-04 09:38:34 :: [aarch64] #364 maven-surefire-3.0.0_M9-alt1.src.rpm: build OK (cached)
2025-Mar-04 09:38:34 :: [aarch64] #1000 infinispan.git 14.0.1-alt1: build start
2025-Mar-04 09:38:41 :: [ppc64le] #364 maven-surefire-3.0.0_M9-alt1.src.rpm: build OK (cached)
2025-Mar-04 09:38:41 :: [ppc64le] #1000 infinispan.git 14.0.1-alt1: build start
[x86_64] + rm -rf /usr/src/tmp/infinispan-buildroot/usr/share/maven-poms
[x86_64] + rm -rf /usr/src/tmp/infinispan-buildroot/usr/share/maven-metadata
[x86_64] + rm -rf /usr/src/tmp/infinispan-buildroot/usr/share/javadoc
[x86_64] + mkdir -p /usr/src/tmp/infinispan-buildroot/usr/lib/infinispan-server
[x86_64] + cp -a server/runtime/target/infinispan-server-14.0.1.Final/Copyright.txt server/runtime/target/infinispan-server-14.0.1.Final/README.adoc server/runtime/target/infinispan-server-14.0.1.Final/bin server/runtime/target/infinispan-server-14.0.1.Final/boot server/runtime/target/infinispan-server-14.0.1.Final/docs server/runtime/target/infinispan-server-14.0.1.Final/lib server/runtime/target/infinispan-server-14.0.1.Final/server server/runtime/target/infinispan-server-14.0.1.Final/static /usr/src/tmp/infinispan-buildroot/usr/lib/infinispan-server
[x86_64] + mkdir -p /usr/src/tmp/infinispan-buildroot/etc/infinispan /usr/src/tmp/infinispan-buildroot/var/log/infinispan
[x86_64] + mv /usr/src/tmp/infinispan-buildroot/usr/lib/infinispan-server/server/conf/groups.properties /usr/src/tmp/infinispan-buildroot/usr/lib/infinispan-server/server/conf/infinispan-local.xml /usr/src/tmp/infinispan-buildroot/usr/lib/infinispan-server/server/conf/infinispan-xsite.xml /usr/src/tmp/infinispan-buildroot/usr/lib/infinispan-server/server/conf/infinispan.xml /usr/src/tmp/infinispan-buildroot/usr/lib/infinispan-server/server/conf/log4j2.xml /usr/src/tmp/infinispan-buildroot/usr/lib/infinispan-server/server/conf/users.properties /usr/src/tmp/infinispan-buildroot/etc/infinispan
[x86_64] + mv /usr/src/tmp/infinispan-buildroot/usr/lib/infinispan-server/bin/server.conf /usr/src/tmp/infinispan-buildroot/etc/infinispan
[x86_64] + rm -f /usr/src/tmp/infinispan-buildroot/usr/lib/infinispan-server/server/conf /usr/src/tmp/infinispan-buildroot/usr/lib/infinispan-server/server/log
[x86_64] rm: cannot remove '/usr/src/tmp/infinispan-buildroot/usr/lib/infinispan-server/server/conf': Is a directory
2025-Mar-04 09:39:25 :: [x86_64] infinispan.git 14.0.1-alt1: remote: build failed
2025-Mar-04 09:39:25 :: [x86_64] #1000 infinispan.git 14.0.1-alt1: build FAILED
2025-Mar-04 09:39:25 :: [x86_64] requesting cancellation of task processing
[i586] + rm -rf /usr/src/tmp/infinispan-buildroot/usr/share/maven-poms
[i586] + rm -rf /usr/src/tmp/infinispan-buildroot/usr/share/maven-metadata
[i586] + rm -rf /usr/src/tmp/infinispan-buildroot/usr/share/javadoc
[i586] + mkdir -p /usr/src/tmp/infinispan-buildroot/usr/lib/infinispan-server
[i586] + cp -a server/runtime/target/infinispan-server-14.0.1.Final/Copyright.txt server/runtime/target/infinispan-server-14.0.1.Final/README.adoc server/runtime/target/infinispan-server-14.0.1.Final/bin server/runtime/target/infinispan-server-14.0.1.Final/boot server/runtime/target/infinispan-server-14.0.1.Final/docs server/runtime/target/infinispan-server-14.0.1.Final/lib server/runtime/target/infinispan-server-14.0.1.Final/server server/runtime/target/infinispan-server-14.0.1.Final/static /usr/src/tmp/infinispan-buildroot/usr/lib/infinispan-server
[i586] + mkdir -p /usr/src/tmp/infinispan-buildroot/etc/infinispan /usr/src/tmp/infinispan-buildroot/var/log/infinispan
[i586] + mv /usr/src/tmp/infinispan-buildroot/usr/lib/infinispan-server/server/conf/groups.properties /usr/src/tmp/infinispan-buildroot/usr/lib/infinispan-server/server/conf/infinispan-local.xml /usr/src/tmp/infinispan-buildroot/usr/lib/infinispan-server/server/conf/infinispan-xsite.xml /usr/src/tmp/infinispan-buildroot/usr/lib/infinispan-server/server/conf/infinispan.xml /usr/src/tmp/infinispan-buildroot/usr/lib/infinispan-server/server/conf/log4j2.xml /usr/src/tmp/infinispan-buildroot/usr/lib/infinispan-server/server/conf/users.properties /usr/src/tmp/infinispan-buildroot/etc/infinispan
[i586] + mv /usr/src/tmp/infinispan-buildroot/usr/lib/infinispan-server/bin/server.conf /usr/src/tmp/infinispan-buildroot/etc/infinispan
[i586] + rm -f /usr/src/tmp/infinispan-buildroot/usr/lib/infinispan-server/server/conf /usr/src/tmp/infinispan-buildroot/usr/lib/infinispan-server/server/log
[i586] rm: cannot remove '/usr/src/tmp/infinispan-buildroot/usr/lib/infinispan-server/server/conf': Is a directory
2025-Mar-04 09:40:08 :: [i586] infinispan.git 14.0.1-alt1: remote: build failed
2025-Mar-04 09:40:08 :: [i586] #1000 infinispan.git 14.0.1-alt1: build FAILED
[aarch64] + rm -rf /usr/src/tmp/infinispan-buildroot/usr/share/maven-poms
[aarch64] + rm -rf /usr/src/tmp/infinispan-buildroot/usr/share/maven-metadata
[aarch64] + rm -rf /usr/src/tmp/infinispan-buildroot/usr/share/javadoc
[aarch64] + mkdir -p /usr/src/tmp/infinispan-buildroot/usr/lib/infinispan-server
[aarch64] + cp -a server/runtime/target/infinispan-server-14.0.1.Final/Copyright.txt server/runtime/target/infinispan-server-14.0.1.Final/README.adoc server/runtime/target/infinispan-server-14.0.1.Final/bin server/runtime/target/infinispan-server-14.0.1.Final/boot server/runtime/target/infinispan-server-14.0.1.Final/docs server/runtime/target/infinispan-server-14.0.1.Final/lib server/runtime/target/infinispan-server-14.0.1.Final/server server/runtime/target/infinispan-server-14.0.1.Final/static /usr/src/tmp/infinispan-buildroot/usr/lib/infinispan-server
[aarch64] + mkdir -p /usr/src/tmp/infinispan-buildroot/etc/infinispan /usr/src/tmp/infinispan-buildroot/var/log/infinispan
[aarch64] + mv /usr/src/tmp/infinispan-buildroot/usr/lib/infinispan-server/server/conf/groups.properties /usr/src/tmp/infinispan-buildroot/usr/lib/infinispan-server/server/conf/infinispan-local.xml /usr/src/tmp/infinispan-buildroot/usr/lib/infinispan-server/server/conf/infinispan-xsite.xml /usr/src/tmp/infinispan-buildroot/usr/lib/infinispan-server/server/conf/infinispan.xml /usr/src/tmp/infinispan-buildroot/usr/lib/infinispan-server/server/conf/log4j2.xml /usr/src/tmp/infinispan-buildroot/usr/lib/infinispan-server/server/conf/users.properties /usr/src/tmp/infinispan-buildroot/etc/infinispan
[aarch64] + mv /usr/src/tmp/infinispan-buildroot/usr/lib/infinispan-server/bin/server.conf /usr/src/tmp/infinispan-buildroot/etc/infinispan
[aarch64] + rm -f /usr/src/tmp/infinispan-buildroot/usr/lib/infinispan-server/server/conf /usr/src/tmp/infinispan-buildroot/usr/lib/infinispan-server/server/log
[aarch64] rm: cannot remove '/usr/src/tmp/infinispan-buildroot/usr/lib/infinispan-server/server/conf': Is a directory
2025-Mar-04 09:44:47 :: [aarch64] infinispan.git 14.0.1-alt1: remote: build failed
2025-Mar-04 09:44:47 :: [aarch64] #1000 infinispan.git 14.0.1-alt1: build FAILED
[ppc64le] + rm -rf /usr/src/tmp/infinispan-buildroot/usr/share/maven-poms
[ppc64le] + rm -rf /usr/src/tmp/infinispan-buildroot/usr/share/maven-metadata
[ppc64le] + rm -rf /usr/src/tmp/infinispan-buildroot/usr/share/javadoc
[ppc64le] + mkdir -p /usr/src/tmp/infinispan-buildroot/usr/lib/infinispan-server
[ppc64le] + cp -a server/runtime/target/infinispan-server-14.0.1.Final/Copyright.txt server/runtime/target/infinispan-server-14.0.1.Final/README.adoc server/runtime/target/infinispan-server-14.0.1.Final/bin server/runtime/target/infinispan-server-14.0.1.Final/boot server/runtime/target/infinispan-server-14.0.1.Final/docs server/runtime/target/infinispan-server-14.0.1.Final/lib server/runtime/target/infinispan-server-14.0.1.Final/server server/runtime/target/infinispan-server-14.0.1.Final/static /usr/src/tmp/infinispan-buildroot/usr/lib/infinispan-server
[ppc64le] + mkdir -p /usr/src/tmp/infinispan-buildroot/etc/infinispan /usr/src/tmp/infinispan-buildroot/var/log/infinispan
[ppc64le] + mv /usr/src/tmp/infinispan-buildroot/usr/lib/infinispan-server/server/conf/groups.properties /usr/src/tmp/infinispan-buildroot/usr/lib/infinispan-server/server/conf/infinispan-local.xml /usr/src/tmp/infinispan-buildroot/usr/lib/infinispan-server/server/conf/infinispan-xsite.xml /usr/src/tmp/infinispan-buildroot/usr/lib/infinispan-server/server/conf/infinispan.xml /usr/src/tmp/infinispan-buildroot/usr/lib/infinispan-server/server/conf/log4j2.xml /usr/src/tmp/infinispan-buildroot/usr/lib/infinispan-server/server/conf/users.properties /usr/src/tmp/infinispan-buildroot/etc/infinispan
[ppc64le] + mv /usr/src/tmp/infinispan-buildroot/usr/lib/infinispan-server/bin/server.conf /usr/src/tmp/infinispan-buildroot/etc/infinispan
[ppc64le] + rm -f /usr/src/tmp/infinispan-buildroot/usr/lib/infinispan-server/server/conf /usr/src/tmp/infinispan-buildroot/usr/lib/infinispan-server/server/log
[ppc64le] rm: cannot remove '/usr/src/tmp/infinispan-buildroot/usr/lib/infinispan-server/server/conf': Is a directory
2025-Mar-04 09:46:21 :: [ppc64le] infinispan.git 14.0.1-alt1: remote: build failed
2025-Mar-04 09:46:21 :: [ppc64le] #1000 infinispan.git 14.0.1-alt1: build FAILED
2025-Mar-04 09:39:25 :: [x86_64] build FAILED
2025-Mar-04 09:40:08 :: [i586] build FAILED
2025-Mar-04 09:44:47 :: [aarch64] build FAILED
2025-Mar-04 09:46:21 :: [ppc64le] build FAILED
2025-Mar-04 09:46:21 :: task #375221 for sisyphus FAILED
More information about the Sisyphus-incominger
mailing list