[#376630] [test-only] FAILED keycloak.git=26.1.3-alt1

Girar awaiter (cas) girar-builder at altlinux.org
Sun Mar 2 08:13:06 MSK 2025


https://git.altlinux.org/tasks/376630/logs/events.1.1.log
https://packages.altlinux.org/tasks/376630

subtask  name      aarch64  i586  ppc64le  x86_64
   #100  keycloak        -     -        -  failed

2025-Mar-02 05:11:02 :: test-only task #376630 for sisyphus started by cas:
#100 build 26.1.3-alt1 from /people/cas/packages/keycloak.git fetched at 2025-Mar-02 05:10:57
2025-Mar-02 05:11:03 :: [ppc64le] #100 keycloak.git 26.1.3-alt1: build start
2025-Mar-02 05:11:03 :: [i586] #100 keycloak.git 26.1.3-alt1: build start
2025-Mar-02 05:11:03 :: [aarch64] #100 keycloak.git 26.1.3-alt1: build start
2025-Mar-02 05:11:03 :: [x86_64] #100 keycloak.git 26.1.3-alt1: build start
2025-Mar-02 05:11:22 :: [i586] #100 keycloak.git 26.1.3-alt1: build SKIPPED
2025-Mar-02 05:11:30 :: [aarch64] #100 keycloak.git 26.1.3-alt1: build SKIPPED
2025-Mar-02 05:11:32 :: [ppc64le] #100 keycloak.git 26.1.3-alt1: build SKIPPED
[x86_64] [ERROR]   
[x86_64] [ERROR]   The project org.keycloak:keycloak-parent:26.1.3 (/usr/src/RPM/BUILD/keycloak-26.1.3/quarkus/../pom.xml) has 1 error
[x86_64] [ERROR]     Non-resolvable parent POM for org.keycloak:keycloak-parent:26.1.3: Could not transfer artifact org.jboss:jboss-parent:pom:39 from/to central (https://repo.maven.apache.org/maven2): transfer failed for https://repo.maven.apache.org/maven2/org/jboss/jboss-parent/39/jboss-parent-39.pom and 'parent.relativePath' points at wrong local POM @ line 21, column 13: Unknown host repo.maven.apache.org -> [Help 2]
[x86_64] [ERROR] 
[x86_64] [ERROR] To see the full stack trace of the errors, re-run Maven with the -e switch.
[x86_64] [ERROR] Re-run Maven using the -X switch to enable full debug logging.
[x86_64] [ERROR] 
[x86_64] [ERROR] For more information about the errors and possible solutions, please read the following articles:
[x86_64] [ERROR] [Help 1] http://cwiki.apache.org/confluence/display/MAVEN/ProjectBuildingException
[x86_64] [ERROR] [Help 2] http://cwiki.apache.org/confluence/display/MAVEN/UnresolvableModelException
2025-Mar-02 05:13:06 :: [x86_64] keycloak.git 26.1.3-alt1: remote: build failed
2025-Mar-02 05:13:06 :: [x86_64] #100 keycloak.git 26.1.3-alt1: build FAILED
2025-Mar-02 05:13:06 :: [x86_64] requesting cancellation of task processing
2025-Mar-02 05:13:06 :: [x86_64] build FAILED
2025-Mar-02 05:13:06 :: task #376630 for sisyphus FAILED


More information about the Sisyphus-incominger mailing list