[#369749] [test-only] FAILED gdcm.git=3.0.24-alt2 cpp-base64.git=2.rc.08-alt1 itk.git=5.4.2-alt1 ...
Girar awaiter (protvin)
girar-builder at altlinux.org
Mon Jan 20 13:40:58 MSK 2025
https://git.altlinux.org/tasks/369749/logs/events.1.1.log
https://packages.altlinux.org/tasks/369749
subtask name aarch64 i586 ppc64le x86_64
#100 gdcm 8:53 6:21 10:14 5:45
#200 cpp-base64 54 37 57 36
#300 itk 30:37 14:42 33:22 12:30
#400 slicer ? ? ? failed
2025-Jan-20 09:56:20 :: test-only task #369749 for sisyphus started by protvin:
2025-Jan-20 09:56:20 :: message: Update itk.
#100 build 3.0.24-alt2 from /people/protvin/packages/gdcm.git fetched at 2025-Jan-20 09:00:28
#200 build 2.rc.08-alt1 from /people/protvin/packages/cpp-base64.git fetched at 2025-Jan-20 09:31:27
#300 build 5.4.2-alt1 from /people/protvin/packages/itk.git fetched at 2025-Jan-20 09:47:14
#400 build 5.6.2-alt1 from /gears/s/slicer.git fetched at 2025-Jan-20 09:49:36 from sisyphus
2025-Jan-20 09:56:22 :: created build repo
2025-Jan-20 09:56:23 :: [x86_64] #100 gdcm.git 3.0.24-alt2: build start
2025-Jan-20 09:56:23 :: [aarch64] #100 gdcm.git 3.0.24-alt2: build start
2025-Jan-20 09:56:23 :: [i586] #100 gdcm.git 3.0.24-alt2: build start
2025-Jan-20 09:56:23 :: [ppc64le] #100 gdcm.git 3.0.24-alt2: build start
2025-Jan-20 10:02:08 :: [x86_64] #100 gdcm.git 3.0.24-alt2: build OK
2025-Jan-20 10:02:09 :: [x86_64] #200 cpp-base64.git 2.rc.08-alt1: build start
2025-Jan-20 10:02:44 :: [i586] #100 gdcm.git 3.0.24-alt2: build OK
2025-Jan-20 10:02:44 :: [i586] #200 cpp-base64.git 2.rc.08-alt1: build start
2025-Jan-20 10:02:45 :: [x86_64] #200 cpp-base64.git 2.rc.08-alt1: build OK
2025-Jan-20 10:02:45 :: [x86_64] #300 itk.git 5.4.2-alt1: build start
2025-Jan-20 10:03:21 :: [i586] #200 cpp-base64.git 2.rc.08-alt1: build OK
2025-Jan-20 10:03:21 :: [i586] #300 itk.git 5.4.2-alt1: build start
2025-Jan-20 10:05:16 :: [aarch64] #100 gdcm.git 3.0.24-alt2: build OK
2025-Jan-20 10:05:17 :: [aarch64] #200 cpp-base64.git 2.rc.08-alt1: build start
2025-Jan-20 10:06:11 :: [aarch64] #200 cpp-base64.git 2.rc.08-alt1: build OK
2025-Jan-20 10:06:12 :: [aarch64] #300 itk.git 5.4.2-alt1: build start
2025-Jan-20 10:06:37 :: [ppc64le] #100 gdcm.git 3.0.24-alt2: build OK
2025-Jan-20 10:06:37 :: [ppc64le] #200 cpp-base64.git 2.rc.08-alt1: build start
2025-Jan-20 10:07:34 :: [ppc64le] #200 cpp-base64.git 2.rc.08-alt1: build OK
2025-Jan-20 10:07:35 :: [ppc64le] #300 itk.git 5.4.2-alt1: build start
2025-Jan-20 10:15:15 :: [x86_64] #300 itk.git 5.4.2-alt1: build OK
2025-Jan-20 10:15:15 :: [x86_64] #400 slicer.git 5.6.2-alt1: build start
[x86_64] gmake[2]: Leaving directory '/usr/src/RPM/BUILD/slicer-5.6.2/x86_64-alt-linux'
[x86_64] gmake[2]: Entering directory '/usr/src/RPM/BUILD/slicer-5.6.2/x86_64-alt-linux'
[x86_64] [ 3%] Linking CXX shared library ../../../usr/lib64/Slicer-5.6/cli-modules/libResampleScalarVectorDWIVolumeLib.so
[x86_64] cd /usr/src/RPM/BUILD/slicer-5.6.2/x86_64-alt-linux/Modules/CLI/ResampleScalarVectorDWIVolume && /usr/bin/cmake -E cmake_link_script CMakeFiles/ResampleScalarVectorDWIVolumeLib.dir/link.txt --verbose=1
[x86_64] /usr/bin/c++ -fPIC -Wall -Wextra -Wpointer-arith -Winvalid-pch -Wcast-align -Wwrite-strings -D_FORTIFY_SOURCE=2 -fdiagnostics-show-option -Wl,--no-undefined -fstack-protector-all -Wno-deprecated -Woverloaded-virtual -Wstrict-null-sentinel -fno-sized-deallocation -msse2 -Wall -Wno-deprecated -fno-sized-deallocation -msse2 -g -shared -Wl,-soname,libResampleScalarVectorDWIVolumeLib.so -o ../../../usr/lib64/Slicer-5.6/cli-modules/libResampleScalarVectorDWIVolumeLib.so CMakeFiles/ResampleScalarVectorDWIVolumeLib.dir/__/ResampleDTIVolume/dtiprocessFiles/deformationfieldio.cxx.o CMakeFiles/ResampleScalarVectorDWIVolumeLib.dir/ResampleScalarVectorDWIVolume.cxx.o -lvnl_algo -lvnl -lv3p_netlib -lv3px_netlib -lvcl /usr/lib64/libITKIOImageBase-5.4.so.1 /usr/lib64/libITKIOTransformBase-5.4.so.1 /usr/lib64/libITKSmoothing-5.4.so.1 /usr/lib64/libITKMetaIO-5.4.so.1 /usr/lib64/libz.so /usr/lib64/libITKConvolution-5.4.so.1 /usr/lib64/libITKFFT-5.4.so.1 /usr/lib64/libITKTransformFactory-5.4.so.1 /usr/lib64/libjsoncpp.so /usr/lib64/libITKStatistics-5.4.so.1 /usr/lib64/libitkNetlibSlatec-5.4.so.1 /usr/lib64/libITKSpatialObjects-5.4.so.1 /usr/lib64/libITKTransform-5.4.so.1 /usr/lib64/libITKPath-5.4.so.1 /usr/lib64/libITKCommon-5.4.so.1 /usr/lib64/libitksys-5.4.so.1 /usr/lib64/libITKVNLInstantiation-5.4.so.1 -lvnl_algo -lvnl -lv3p_netlib -lv3px_netlib -lvcl -lm -ldl -lfftw3_threads -lfftw3 -lfftw3f_threads -lfftw3f
[x86_64] gmake[2]: Leaving directory '/usr/src/RPM/BUILD/slicer-5.6.2/x86_64-alt-linux'
[x86_64] gmake[1]: Entering directory '/usr/src/RPM/BUILD/slicer-5.6.2/x86_64-alt-linux'
[x86_64] [ 3%] Built target ResampleScalarVectorDWIVolumeLib
[x86_64] gmake[1]: Leaving directory '/usr/src/RPM/BUILD/slicer-5.6.2/x86_64-alt-linux'
[x86_64] gmake: *** [Makefile:156: all] Error 2
2025-Jan-20 10:17:54 :: [x86_64] slicer.git 5.6.2-alt1: remote: build failed
2025-Jan-20 10:17:54 :: [x86_64] #400 slicer.git 5.6.2-alt1: build FAILED
2025-Jan-20 10:17:54 :: [x86_64] requesting cancellation of task processing
2025-Jan-20 10:18:03 :: [i586] #300 itk.git 5.4.2-alt1: build OK
2025-Jan-20 10:18:03 :: [i586] task processing CANCELLED
2025-Jan-20 10:36:49 :: [aarch64] #300 itk.git 5.4.2-alt1: build OK
2025-Jan-20 10:36:49 :: [aarch64] task processing CANCELLED
2025-Jan-20 10:40:57 :: [ppc64le] #300 itk.git 5.4.2-alt1: build OK
2025-Jan-20 10:40:58 :: [ppc64le] task processing CANCELLED
2025-Jan-20 10:17:54 :: [x86_64] build FAILED
2025-Jan-20 10:18:03 :: [i586] build FAILED
2025-Jan-20 10:36:49 :: [aarch64] build FAILED
2025-Jan-20 10:40:58 :: [ppc64le] build FAILED
2025-Jan-20 10:40:58 :: task #369749 for sisyphus FAILED
More information about the Sisyphus-incominger
mailing list