[#375553] FAILED (try 3) srpm=icu-7.6.1-alt1.src.rpm srpm=libharfbuzz-10.3.0-alt1.src.rpm ...

Girar awaiter (aris) girar-builder at altlinux.org
Fri Feb 21 22:09:35 MSK 2025


https://git.altlinux.org/tasks/375553/logs/events.3.1.log
https://packages.altlinux.org/tasks/375553

subtask  name             aarch64   i586  ppc64le  x86_64
   #140  libharfbuzz         3:52   2:42     4:20    2:29
   #300  libwebkitgtk4    1:18:21  38:27    55:54   31:22
   #340  libmozjs128            ?   7:33    10:09    6:17
   #500  vte3                   ?   1:56     4:04    1:59
   #600  libical                ?   1:40     3:15    1:40
   #700  libwebkitgtk4.1        ?  35:18        ?   30:49
  #1000  libgspell              ?      ?        ?    1:36
  #1100  libphonenumber         ?      ?        ?  failed

2025-Feb-21 17:41:36 :: task #375553 for sisyphus resumed by aris:
2025-Feb-21 17:41:36 :: message: icu-76.1
#100 build icu-7.6.1-alt1.src.rpm
#140 build libharfbuzz-10.3.0-alt1.src.rpm from sisyphus
#200 removed
#300 build libwebkitgtk4-2.46.6-alt1.src.rpm from sisyphus
#340 build libmozjs128-128.1.0-alt1.1.src.rpm
#400 removed
#500 build vte3-0.78.3-alt1.src.rpm from sisyphus
#600 build libical-3.0.19-alt1.src.rpm from sisyphus
#700 build libwebkitgtk4.1-2.46.6-alt1.src.rpm from sisyphus
#1000 build libgspell-1.12.2-alt1.1.src.rpm from sisyphus
#1100 build libphonenumber-8.13.55-alt1.src.rpm from sisyphus
#1200 build evolution-data-server-3.54.3-alt1.src.rpm from sisyphus
#1300 build tinysparql-3.8.2-alt1.src.rpm from sisyphus
#1400 build libwebkitgtk6.0-2.46.6-alt1.src.rpm from sisyphus
#1500 build libgedit-tepl-6.12.0-alt1.src.rpm from sisyphus
#1600 build localsearch-3.8.2-alt1.src.rpm from sisyphus
#1700 build libspelling-0.4.6-alt1.src.rpm from sisyphus
#2000 build gnome-builder-47.2-alt1.src.rpm from sisyphus
#2100 build darktable-5.0.1-alt1.src.rpm from sisyphus
#2200 build geary-46.0-alt1.src.rpm from sisyphus
#2300 build gnome-text-editor-47.3-alt1.src.rpm from sisyphus
#2400 build poedit-3.5.2-alt1.src.rpm from sisyphus
#2500 build python3-module-icu-2.14-alt1.src.rpm from sisyphus
#2600 build 3.47.1-alt1 from /gears/s/sqlite3.git fetched at 2025-Feb-21 11:34:53 from sisyphus
#2700 build 1.86.0-alt2 from /gears/b/boost.git fetched at 2025-Feb-21 11:35:03 from sisyphus
#3000 build 3.9.0-alt1.1 from /gears/f/freerdp3.git fetched at 2025-Feb-21 11:35:07 from sisyphus
#3100 build libmozjs115-115.2.0-alt2.1.src.rpm
#3200 build icu74-7.4.2-alt2.src.rpm
2025-Feb-21 17:41:37 :: created build repo
2025-Feb-21 17:41:38 :: [i586] #100 icu-7.6.1-alt1.src.rpm: build start
2025-Feb-21 17:41:38 :: [aarch64] #100 icu-7.6.1-alt1.src.rpm: build start
2025-Feb-21 17:41:38 :: [ppc64le] #100 icu-7.6.1-alt1.src.rpm: build start
2025-Feb-21 17:41:38 :: [x86_64] #100 icu-7.6.1-alt1.src.rpm: build start
2025-Feb-21 17:41:56 :: [i586] #100 icu-7.6.1-alt1.src.rpm: build OK (cached)
2025-Feb-21 17:41:56 :: [i586] #140 libharfbuzz-10.3.0-alt1.src.rpm: build start
2025-Feb-21 17:41:57 :: [x86_64] #100 icu-7.6.1-alt1.src.rpm: build OK (cached)
2025-Feb-21 17:41:57 :: [x86_64] #140 libharfbuzz-10.3.0-alt1.src.rpm: build start
2025-Feb-21 17:42:15 :: [aarch64] #100 icu-7.6.1-alt1.src.rpm: build OK (cached)
2025-Feb-21 17:42:15 :: [aarch64] #140 libharfbuzz-10.3.0-alt1.src.rpm: build start
2025-Feb-21 17:42:23 :: [ppc64le] #100 icu-7.6.1-alt1.src.rpm: build OK (cached)
2025-Feb-21 17:42:23 :: [ppc64le] #140 libharfbuzz-10.3.0-alt1.src.rpm: build start
2025-Feb-21 17:44:26 :: [x86_64] #140 libharfbuzz-10.3.0-alt1.src.rpm: build OK
2025-Feb-21 17:44:26 :: [x86_64] #300 libwebkitgtk4-2.46.6-alt1.src.rpm: build start
2025-Feb-21 17:44:38 :: [i586] #140 libharfbuzz-10.3.0-alt1.src.rpm: build OK
2025-Feb-21 17:44:39 :: [i586] #300 libwebkitgtk4-2.46.6-alt1.src.rpm: build start
2025-Feb-21 17:46:07 :: [aarch64] #140 libharfbuzz-10.3.0-alt1.src.rpm: build OK
2025-Feb-21 17:46:07 :: [aarch64] #300 libwebkitgtk4-2.46.6-alt1.src.rpm: build start
2025-Feb-21 17:46:43 :: [ppc64le] #140 libharfbuzz-10.3.0-alt1.src.rpm: build OK
2025-Feb-21 17:46:43 :: [ppc64le] #300 libwebkitgtk4-2.46.6-alt1.src.rpm: build start
2025-Feb-21 18:15:48 :: [x86_64] #300 libwebkitgtk4-2.46.6-alt1.src.rpm: build OK
2025-Feb-21 18:15:49 :: [x86_64] #340 libmozjs128-128.1.0-alt1.1.src.rpm: build start
2025-Feb-21 18:22:06 :: [x86_64] #340 libmozjs128-128.1.0-alt1.1.src.rpm: build OK
2025-Feb-21 18:22:06 :: [x86_64] #500 vte3-0.78.3-alt1.src.rpm: build start
2025-Feb-21 18:23:06 :: [i586] #300 libwebkitgtk4-2.46.6-alt1.src.rpm: build OK
2025-Feb-21 18:23:07 :: [i586] #340 libmozjs128-128.1.0-alt1.1.src.rpm: build start
2025-Feb-21 18:24:05 :: [x86_64] #500 vte3-0.78.3-alt1.src.rpm: build OK
2025-Feb-21 18:24:05 :: [x86_64] #600 libical-3.0.19-alt1.src.rpm: build start
2025-Feb-21 18:25:45 :: [x86_64] #600 libical-3.0.19-alt1.src.rpm: build OK
2025-Feb-21 18:25:45 :: [x86_64] #700 libwebkitgtk4.1-2.46.6-alt1.src.rpm: build start
2025-Feb-21 18:30:40 :: [i586] #340 libmozjs128-128.1.0-alt1.1.src.rpm: build OK
2025-Feb-21 18:30:40 :: [i586] #500 vte3-0.78.3-alt1.src.rpm: build start
2025-Feb-21 18:32:36 :: [i586] #500 vte3-0.78.3-alt1.src.rpm: build OK
2025-Feb-21 18:32:36 :: [i586] #600 libical-3.0.19-alt1.src.rpm: build start
2025-Feb-21 18:34:16 :: [i586] #600 libical-3.0.19-alt1.src.rpm: build OK
2025-Feb-21 18:34:16 :: [i586] #700 libwebkitgtk4.1-2.46.6-alt1.src.rpm: build start
2025-Feb-21 18:42:37 :: [ppc64le] #300 libwebkitgtk4-2.46.6-alt1.src.rpm: build OK
2025-Feb-21 18:42:37 :: [ppc64le] #340 libmozjs128-128.1.0-alt1.1.src.rpm: build start
2025-Feb-21 18:52:46 :: [ppc64le] #340 libmozjs128-128.1.0-alt1.1.src.rpm: build OK
2025-Feb-21 18:52:46 :: [ppc64le] #500 vte3-0.78.3-alt1.src.rpm: build start
2025-Feb-21 18:56:34 :: [x86_64] #700 libwebkitgtk4.1-2.46.6-alt1.src.rpm: build OK
2025-Feb-21 18:56:35 :: [x86_64] #1000 libgspell-1.12.2-alt1.1.src.rpm: build start
2025-Feb-21 18:56:50 :: [ppc64le] #500 vte3-0.78.3-alt1.src.rpm: build OK
2025-Feb-21 18:56:50 :: [ppc64le] #600 libical-3.0.19-alt1.src.rpm: build start
2025-Feb-21 18:58:11 :: [x86_64] #1000 libgspell-1.12.2-alt1.1.src.rpm: build OK
2025-Feb-21 18:58:11 :: [x86_64] #1100 libphonenumber-8.13.55-alt1.src.rpm: build start
[x86_64] /usr/src/RPM/BUILD/libphonenumber-8.13.55/cpp/src/phonenumbers/phonenumberutil.cc: In function 'bool i18n::phonenumbers::{anonymous}::LoadCompiledInMetadata(i18n::phonenumbers::PhoneMetadataCollection*)':
[x86_64] /usr/src/RPM/BUILD/libphonenumber-8.13.55/cpp/src/phonenumbers/phonenumberutil.cc:125:33: error: 'metadata_get' was not declared in this scope; did you mean 'metadata'?
[x86_64]   125 |   if (!metadata->ParseFromArray(metadata_get(), metadata_size())) {
[x86_64]       |                                 metadata
[x86_64] /usr/src/RPM/BUILD/libphonenumber-8.13.55/cpp/src/phonenumbers/phonenumberutil.cc:125:49: error: 'metadata_size' was not declared in this scope; did you mean 'metadata'?
[x86_64]   125 |   if (!metadata->ParseFromArray(metadata_get(), metadata_size())) {
2025-Feb-21 18:58:51 :: [x86_64] libphonenumber-8.13.55-alt1.src.rpm: remote: build failed
2025-Feb-21 18:58:51 :: [x86_64] #1100 libphonenumber-8.13.55-alt1.src.rpm: build FAILED
2025-Feb-21 18:58:51 :: [x86_64] requesting cancellation of task processing
2025-Feb-21 19:00:05 :: [ppc64le] #600 libical-3.0.19-alt1.src.rpm: build OK
2025-Feb-21 19:00:06 :: [ppc64le] task processing CANCELLED
2025-Feb-21 19:04:28 :: [aarch64] #300 libwebkitgtk4-2.46.6-alt1.src.rpm: build OK
2025-Feb-21 19:04:28 :: [aarch64] task processing CANCELLED
2025-Feb-21 19:09:34 :: [i586] #700 libwebkitgtk4.1-2.46.6-alt1.src.rpm: build OK
2025-Feb-21 19:09:34 :: [i586] task processing CANCELLED
2025-Feb-21 18:58:51 :: [x86_64] build FAILED
2025-Feb-21 19:00:06 :: [ppc64le] build FAILED
2025-Feb-21 19:04:28 :: [aarch64] build FAILED
2025-Feb-21 19:09:34 :: [i586] build FAILED
2025-Feb-21 19:09:34 :: task #375553 for sisyphus FAILED


More information about the Sisyphus-incominger mailing list