[#373037] [test-only] FAILED grimp.git=3.5-alt1

Girar awaiter (alpacost) girar-builder at altlinux.org
Mon Feb 3 11:04:17 MSK 2025


https://git.altlinux.org/tasks/373037/logs/events.1.1.log
https://packages.altlinux.org/tasks/373037

subtask  name   aarch64    i586  ppc64le  x86_64
   #100  grimp   failed  failed   failed  failed

2025-Feb-03 08:02:39 :: test-only task #373037 for sisyphus started by alpacost:
#100 build 3.5-alt1 from /people/alpacost/packages/grimp.git fetched at 2025-Feb-03 08:02:11
2025-Feb-03 08:02:40 :: [x86_64] #100 grimp.git 3.5-alt1: build start
2025-Feb-03 08:02:40 :: [i586] #100 grimp.git 3.5-alt1: build start
2025-Feb-03 08:02:40 :: [ppc64le] #100 grimp.git 3.5-alt1: build start
2025-Feb-03 08:02:40 :: [aarch64] #100 grimp.git 3.5-alt1: build start
[i586]                 "Could not find package '{}' in your Python path.".format(package_name)
[i586] E           ValueError: Could not find package 'requests' in your Python path.
[i586] .run_venv/lib/python3/site-packages/grimp/adaptors/packagefinder.py:23: ValueError
[i586] =========================== short test summary info ============================
[i586] FAILED tests/functional/test_build_graph_on_real_packages.py::test_build_graph_on_real_package[requests]
[i586] =================== 1 failed, 683 passed, 4 skipped in 3.77s ===================
[i586] INFO     : Command's result: FAILURE
[i586] INFO     : Command's error: Command '['python3', '-m', 'pytest']' returned non-zero exit status 1.
2025-Feb-03 08:03:32 :: [i586] grimp.git 3.5-alt1: remote: build failed
2025-Feb-03 08:03:32 :: [i586] #100 grimp.git 3.5-alt1: build FAILED
2025-Feb-03 08:03:32 :: [i586] requesting cancellation of task processing
[x86_64]                 "Could not find package '{}' in your Python path.".format(package_name)
[x86_64] E           ValueError: Could not find package 'requests' in your Python path.
[x86_64] .run_venv/lib64/python3/site-packages/grimp/adaptors/packagefinder.py:23: ValueError
[x86_64] =========================== short test summary info ============================
[x86_64] FAILED tests/functional/test_build_graph_on_real_packages.py::test_build_graph_on_real_package[requests]
[x86_64] =================== 1 failed, 683 passed, 4 skipped in 5.09s ===================
[x86_64] INFO     : Command's result: FAILURE
[x86_64] INFO     : Command's error: Command '['python3', '-m', 'pytest']' returned non-zero exit status 1.
2025-Feb-03 08:03:51 :: [x86_64] grimp.git 3.5-alt1: remote: build failed
2025-Feb-03 08:03:51 :: [x86_64] #100 grimp.git 3.5-alt1: build FAILED
[aarch64]                 "Could not find package '{}' in your Python path.".format(package_name)
[aarch64] E           ValueError: Could not find package 'requests' in your Python path.
[aarch64] .run_venv/lib64/python3/site-packages/grimp/adaptors/packagefinder.py:23: ValueError
[aarch64] =========================== short test summary info ============================
[aarch64] FAILED tests/functional/test_build_graph_on_real_packages.py::test_build_graph_on_real_package[requests]
[aarch64] =================== 1 failed, 683 passed, 4 skipped in 6.58s ===================
[aarch64] INFO     : Command's result: FAILURE
[aarch64] INFO     : Command's error: Command '['python3', '-m', 'pytest']' returned non-zero exit status 1.
2025-Feb-03 08:04:07 :: [aarch64] grimp.git 3.5-alt1: remote: build failed
2025-Feb-03 08:04:07 :: [aarch64] #100 grimp.git 3.5-alt1: build FAILED
[ppc64le]                 "Could not find package '{}' in your Python path.".format(package_name)
[ppc64le] E           ValueError: Could not find package 'requests' in your Python path.
[ppc64le] .run_venv/lib64/python3/site-packages/grimp/adaptors/packagefinder.py:23: ValueError
[ppc64le] =========================== short test summary info ============================
[ppc64le] FAILED tests/functional/test_build_graph_on_real_packages.py::test_build_graph_on_real_package[requests]
[ppc64le] =================== 1 failed, 683 passed, 4 skipped in 8.67s ===================
[ppc64le] INFO     : Command's result: FAILURE
[ppc64le] INFO     : Command's error: Command '['python3', '-m', 'pytest']' returned non-zero exit status 1.
2025-Feb-03 08:04:16 :: [ppc64le] grimp.git 3.5-alt1: remote: build failed
2025-Feb-03 08:04:16 :: [ppc64le] #100 grimp.git 3.5-alt1: build FAILED
2025-Feb-03 08:03:32 :: [i586] build FAILED
2025-Feb-03 08:03:51 :: [x86_64] build FAILED
2025-Feb-03 08:04:07 :: [aarch64] build FAILED
2025-Feb-03 08:04:16 :: [ppc64le] build FAILED
2025-Feb-03 08:04:16 :: task #373037 for sisyphus FAILED


More information about the Sisyphus-incominger mailing list