[#356657] [test-only] FAILED openfst.git=1.8.0-alt1 python3-module-srt.git=3.5.3-alt1 ...
Girar awaiter (guschin)
girar-builder at altlinux.org
Mon Sep 2 19:25:57 MSK 2024
https://git.altlinux.org/tasks/356657/logs/events.1.1.log
subtask name aarch64 i586 ppc64le x86_64
#100 openfst failed failed 11:28 6:20
2024-Sep-02 16:14:25 :: test-only task #356657 for sisyphus started by guschin:
#100 build 1.8.0-alt1 from /people/guschin/packages/openfst.git fetched at 2024-Sep-02 16:14:21
#200 build 3.5.3-alt1 from /people/guschin/packages/python3-module-srt.git fetched at 2024-Sep-02 16:14:22
#300 build 0.3.45-alt1 from /people/guschin/packages/vosk-api.git fetched at 2024-Sep-02 16:14:23
2024-Sep-02 16:14:26 :: created build repo
2024-Sep-02 16:14:28 :: [aarch64] #100 openfst.git 1.8.0-alt1: build start
2024-Sep-02 16:14:28 :: [i586] #100 openfst.git 1.8.0-alt1: build start
2024-Sep-02 16:14:28 :: [x86_64] #100 openfst.git 1.8.0-alt1: build start
2024-Sep-02 16:14:28 :: [ppc64le] #100 openfst.git 1.8.0-alt1: build start
[i586] from encode.cc:20:
[i586] ./../include/fst/float-weight.h:116:2: error: #error "Please compile with -msse -mfpmath=sse, or equivalent."
[i586] 116 | #error "Please compile with -msse -mfpmath=sse, or equivalent."
[i586] --
[i586] from symbol-table-ops.cc:19:
[i586] ./../include/fst/float-weight.h:116:2: error: #error "Please compile with -msse -mfpmath=sse, or equivalent."
[i586] 116 | #error "Please compile with -msse -mfpmath=sse, or equivalent."
[i586] --
[i586] from fst.cc:20:
[i586] ./../include/fst/float-weight.h:116:2: error: #error "Please compile with -msse -mfpmath=sse, or equivalent."
[i586] 116 | #error "Please compile with -msse -mfpmath=sse, or equivalent."
[i586] --
[i586] from fst-types.cc:20:
[i586] ./../include/fst/float-weight.h:116:2: error: #error "Please compile with -msse -mfpmath=sse, or equivalent."
[i586] 116 | #error "Please compile with -msse -mfpmath=sse, or equivalent."
2024-Sep-02 16:15:02 :: [i586] openfst.git 1.8.0-alt1: remote: build failed
2024-Sep-02 16:15:02 :: [i586] #100 openfst.git 1.8.0-alt1: build FAILED
2024-Sep-02 16:15:02 :: [i586] requesting cancellation of task processing
[aarch64] ./../../include/fst/mutable-fst.h:335:8: required from here
[aarch64] ./../../include/fst/vector-fst.h:254:35: warning: comparison of integer expressions of different signedness: 'fst::internal::VectorFstBaseImpl<fst::VectorState<fst::ArcTpl<fst::TropicalWeightTpl<float> >, std::allocator<fst::ArcTpl<fst::TropicalWeightTpl<float> > > > >::StateId' {aka 'int'} and 'std::vector<fst::VectorState<fst::ArcTpl<fst::TropicalWeightTpl<float> >, std::allocator<fst::ArcTpl<fst::TropicalWeightTpl<float> > > >*, std::allocator<fst::VectorState<fst::ArcTpl<fst::TropicalWeightTpl<float> >, std::allocator<fst::ArcTpl<fst::TropicalWeightTpl<float> > > >*> >::size_type' {aka 'long unsigned int'} [-Wsign-compare]
[aarch64] 254 | for (StateId state = 0; state < states_.size(); ++state) {
[aarch64] ./../../include/fst/vector-fst.h:264:35: warning: comparison of integer expressions of different signedness: 'fst::internal::VectorFstBaseImpl<fst::VectorState<fst::ArcTpl<fst::TropicalWeightTpl<float> >, std::allocator<fst::ArcTpl<fst::TropicalWeightTpl<float> > > > >::StateId' {aka 'int'} and 'std::vector<fst::VectorState<fst::ArcTpl<fst::TropicalWeightTpl<float> >, std::allocator<fst::ArcTpl<fst::TropicalWeightTpl<float> > > >*, std::allocator<fst::VectorState<fst::ArcTpl<fst::TropicalWeightTpl<float> >, std::allocator<fst::ArcTpl<fst::TropicalWeightTpl<float> > > >*> >::size_type' {aka 'long unsigned int'} [-Wsign-compare]
[aarch64] 264 | for (StateId state = 0; state < states_.size(); ++state) {
[aarch64] make[4]: Leaving directory '/usr/src/RPM/BUILD/openfst-1.8.0/src/extensions/ngram'
[aarch64] make[3]: *** [Makefile:396: all-recursive] Error 1
[aarch64] make[2]: *** [Makefile:371: all-recursive] Error 1
[aarch64] make[1]: *** [Makefile:428: all-recursive] Error 1
[aarch64] make: *** [Makefile:352: all] Error 2
2024-Sep-02 16:19:43 :: [aarch64] openfst.git 1.8.0-alt1: remote: build failed
2024-Sep-02 16:19:43 :: [aarch64] #100 openfst.git 1.8.0-alt1: build FAILED
2024-Sep-02 16:20:48 :: [x86_64] #100 openfst.git 1.8.0-alt1: build OK
2024-Sep-02 16:20:48 :: [x86_64] task processing CANCELLED
2024-Sep-02 16:25:56 :: [ppc64le] #100 openfst.git 1.8.0-alt1: build OK
2024-Sep-02 16:25:56 :: [ppc64le] task processing CANCELLED
2024-Sep-02 16:15:02 :: [i586] build FAILED
2024-Sep-02 16:19:43 :: [aarch64] build FAILED
2024-Sep-02 16:20:48 :: [x86_64] build FAILED
2024-Sep-02 16:25:56 :: [ppc64le] build FAILED
2024-Sep-02 16:25:57 :: task #356657 for sisyphus FAILED
More information about the Sisyphus-incominger
mailing list