[#363423] [test-only] FAILED llvm19.1.git=19.1.4-alt0.1

Girar awaiter (lakostis) girar-builder at altlinux.org
Tue Nov 26 16:50:13 MSK 2024


https://git.altlinux.org/tasks/363423/logs/events.1.1.log

subtask  name      aarch64    i586  ppc64le  x86_64
   #100  llvm19.1  1:36:42  failed    57:52   44:50

2024-Nov-26 12:13:29 :: test-only task #363423 for sisyphus started by lakostis:
#100 build 19.1.4-alt0.1 from /people/lakostis/packages/llvm19.1.git fetched at 2024-Nov-26 12:13:13
2024-Nov-26 12:13:30 :: [i586] #100 llvm19.1.git 19.1.4-alt0.1: build start
2024-Nov-26 12:13:30 :: [aarch64] #100 llvm19.1.git 19.1.4-alt0.1: build start
2024-Nov-26 12:13:30 :: [ppc64le] #100 llvm19.1.git 19.1.4-alt0.1: build start
2024-Nov-26 12:13:30 :: [x86_64] #100 llvm19.1.git 19.1.4-alt0.1: build start
[i586] [12/22] Generating man Sphinx documentation for lldb into "/usr/src/RPM/BUILD/llvm-project-19/i586-alt-linux/tools/lldb/docs/man"
[i586] /usr/src/RPM/BUILD/llvm-project-19/lldb/docs/python_api.rst:8: ERROR: Unknown directive type "automodapi".
[i586] .. automodapi:: lldb
[i586] --
[i586]   :skip: lldb_iter
[i586] /usr/src/RPM/BUILD/llvm-project-19/lldb/docs/python_extensions.rst:12: ERROR: Unknown directive type "automodapi".
[i586] .. automodapi:: lldb.plugins.operating_system
[i586] --
[i586]     :no-inheritance-diagram:
[i586] /usr/src/RPM/BUILD/llvm-project-19/lldb/docs/python_extensions.rst:20: ERROR: Unknown directive type "automodapi".
[i586] .. automodapi:: lldb.plugins.scripted_process
[i586] --
[i586]     :no-inheritance-diagram:
[i586] /usr/src/RPM/BUILD/llvm-project-19/lldb/docs/python_extensions.rst:28: ERROR: Unknown directive type "automodapi".
[i586] .. automodapi:: lldb.plugins.scripted_platform
[i586] --
[i586]     :no-inheritance-diagram:
[i586] /usr/src/RPM/BUILD/llvm-project-19/lldb/docs/python_extensions.rst:36: ERROR: Unknown directive type "automodapi".
[i586] .. automodapi:: lldb.plugins.scripted_thread_plan
[i586] --
[i586] [15/22] Generating html Sphinx documentation for clang into "/usr/src/RPM/BUILD/llvm-project-19/i586-alt-linux/tools/clang/docs/html"
[i586] FAILED: tools/clang/docs/CMakeFiles/docs-clang-html /usr/src/RPM/BUILD/llvm-project-19/i586-alt-linux/tools/clang/docs/CMakeFiles/docs-clang-html 
[i586] cd /usr/src/RPM/BUILD/llvm-project-19/i586-alt-linux/tools/clang/docs && /usr/bin/cmake -E env /usr/bin/sphinx-build-3 -b html -d /usr/src/RPM/BUILD/llvm-project-19/i586-alt-linux/tools/clang/docs/_doctrees-clang-html -q -t builder-html -D version=19 -D release=19.1.4 /usr/src/RPM/BUILD/llvm-project-19/i586-alt-linux/tools/clang/docs /usr/src/RPM/BUILD/llvm-project-19/i586-alt-linux/tools/clang/docs/html
[i586] --
[i586]     with open(outfn + '.map', encoding='utf-8') as mapfile:
[i586] FileNotFoundError: [Errno 2] No such file or directory: '/usr/src/RPM/BUILD/llvm-project-19/i586-alt-linux/tools/clang/docs/html/_images/graphviz-4d52a65fd072512bb39329fb783bdfbdd8bbb1e6.png.map'
[i586] The full traceback has been saved in /usr/src/tmp/sphinx-err-nvo9go5d.log, if you want to report the issue to the developers.
2024-Nov-26 12:44:03 :: [i586] llvm19.1.git 19.1.4-alt0.1: remote: build failed
2024-Nov-26 12:44:03 :: [i586] #100 llvm19.1.git 19.1.4-alt0.1: build FAILED
2024-Nov-26 12:44:03 :: [i586] requesting cancellation of task processing
2024-Nov-26 12:58:20 :: [x86_64] #100 llvm19.1.git 19.1.4-alt0.1: build OK
2024-Nov-26 13:11:22 :: [ppc64le] #100 llvm19.1.git 19.1.4-alt0.1: build OK
2024-Nov-26 13:50:12 :: [aarch64] #100 llvm19.1.git 19.1.4-alt0.1: build OK
2024-Nov-26 12:44:04 :: [i586] build FAILED
2024-Nov-26 13:50:13 :: task #363423 for sisyphus FAILED


More information about the Sisyphus-incominger mailing list