[#348751] [test-only] FAILED chromium.git=125.0.6422.76-alt1

Girar awaiter (cas) girar-builder at altlinux.org
Thu May 23 18:08:50 MSK 2024


https://git.altlinux.org/tasks/348751/logs/events.1.1.log

subtask  name      aarch64  i586  ppc64le  x86_64
   #100  chromium   failed     -        -  failed

2024-May-23 14:51:12 :: test-only task #348751 for sisyphus started by cas:
#100 build 125.0.6422.76-alt1 from /people/cas/packages/chromium.git fetched at 2024-May-23 14:51:07
2024-May-23 14:51:13 :: [ppc64le] #100 chromium.git 125.0.6422.76-alt1: build start
2024-May-23 14:51:13 :: [x86_64] #100 chromium.git 125.0.6422.76-alt1: build start
2024-May-23 14:51:13 :: [aarch64] #100 chromium.git 125.0.6422.76-alt1: build start
2024-May-23 14:51:13 :: [i586] #100 chromium.git 125.0.6422.76-alt1: build start
2024-May-23 14:51:37 :: [i586] #100 chromium.git 125.0.6422.76-alt1: build SKIPPED
2024-May-23 14:51:43 :: [ppc64le] #100 chromium.git 125.0.6422.76-alt1: build SKIPPED
[x86_64] [chrome 10534/59964] clang++ -MD -MF obj/third_party/ruy/ruy_instrumentation/instrumentation.o.d -DRUY_PROFILER -DUSE_UDEV -DUSE_AURA=1 -DUSE_GLIB=1 -DUSE_OZONE=1 -DOFFICIAL_BUILD -D__STDC_CONSTANT_MACROS -D__STDC_FORMAT_MACROS -D_FORTIFY_SOURCE=2 -D_FILE_OFFSET_BITS=64 -D_LARGEFILE_SOURCE -D_LARGEFILE64_SOURCE -DNO_UNWIND_TABLES -D_GNU_SOURCE -D_LIBCPP_HARDENING_MODE=_LIBCPP_HARDENING_MODE_NONE -D_GLIBCXX_ASSERTIONS=1 -DNDEBUG -DNVALGRIND -DDYNAMIC_ANNOTATIONS_ENABLED=0 -I../.. -Igen -I../../third_party/ruy/src -Wall -Wextra -Wimplicit-fallthrough -Wextra-semi -Wunreachable-code-aggressive -Wthread-safety -Wno-missing-field-initializers -Wno-unused-parameter -Wno-psabi -Wloop-analysis -Wno-unneeded-internal-declaration -Wno-cast-function-type -Wno-ignored-pragma-optimize -Wno-deprecated-builtins -Wno-bitfield-constant-conversion -Wno-deprecated-this-capture -Wno-invalid-offsetof -Wno-vla-extension -Wno-thread-safety-reference-return -Wshadow -fno-delete-null-pointer-checks -fno-ident -fno-strict-aliasing -fstack-protector -fno-unwind-tables -fno-asynchronous-unwind-tables -fPIC -pthread -fcolor-diagnostics -fmerge-all-constants -fcrash-diagnostics-dir=../../tools/clang/crashreports -mllvm -instcombine-lower-dbg-declare=0 -ffp-contract=off -flto=thin -fsplit-lto-unit -fwhole-program-vtables -m64 -msse3 -ftrivial-auto-var-init=pattern -O2 -fdata-sections -ffunction-sections -fno-unique-section-names -fno-math-errno -fno-omit-frame-pointer -g0 -fvisibility=hidden -Wheader-hygiene -Wstring-conversion -Wtautological-overlap-compare -Wenum-compare-conditional -Wno-c++11-narrowing-const-reference -std=c++20 -Wno-trigraphs -gsimple-template-names -fno-exceptions -fno-rtti -fvisibility-inlines-hidden  -Wno-unknown-warning-option -Wno-deprecated-declarations -Wno-unused-command-line-argument -Wno-unused-but-set-variable -Wno-unused-result -Wno-unused-function -Wno-unused-variable -Wno-unused-const-variable -Wno-unneeded-internal-declaration -Wno-unknown-attributes -DUSE_SYSTEM_MINIZIP -c ../../third_party/ruy/src/ruy/profiler/instrumentation.cc -o obj/third_party/ruy/ruy_instrumentation/instrumentation.o
[x86_64] FAILED: obj/third_party/ruy/ruy_instrumentation/instrumentation.o 
[x86_64] clang++ -MD -MF obj/third_party/ruy/ruy_instrumentation/instrumentation.o.d -DRUY_PROFILER -DUSE_UDEV -DUSE_AURA=1 -DUSE_GLIB=1 -DUSE_OZONE=1 -DOFFICIAL_BUILD -D__STDC_CONSTANT_MACROS -D__STDC_FORMAT_MACROS -D_FORTIFY_SOURCE=2 -D_FILE_OFFSET_BITS=64 -D_LARGEFILE_SOURCE -D_LARGEFILE64_SOURCE -DNO_UNWIND_TABLES -D_GNU_SOURCE -D_LIBCPP_HARDENING_MODE=_LIBCPP_HARDENING_MODE_NONE -D_GLIBCXX_ASSERTIONS=1 -DNDEBUG -DNVALGRIND -DDYNAMIC_ANNOTATIONS_ENABLED=0 -I../.. -Igen -I../../third_party/ruy/src -Wall -Wextra -Wimplicit-fallthrough -Wextra-semi -Wunreachable-code-aggressive -Wthread-safety -Wno-missing-field-initializers -Wno-unused-parameter -Wno-psabi -Wloop-analysis -Wno-unneeded-internal-declaration -Wno-cast-function-type -Wno-ignored-pragma-optimize -Wno-deprecated-builtins -Wno-bitfield-constant-conversion -Wno-deprecated-this-capture -Wno-invalid-offsetof -Wno-vla-extension -Wno-thread-safety-reference-return -Wshadow -fno-delete-null-pointer-checks -fno-ident -fno-strict-aliasing -fstack-protector -fno-unwind-tables -fno-asynchronous-unwind-tables -fPIC -pthread -fcolor-diagnostics -fmerge-all-constants -fcrash-diagnostics-dir=../../tools/clang/crashreports -mllvm -instcombine-lower-dbg-declare=0 -ffp-contract=off -flto=thin -fsplit-lto-unit -fwhole-program-vtables -m64 -msse3 -ftrivial-auto-var-init=pattern -O2 -fdata-sections -ffunction-sections -fno-unique-section-names -fno-math-errno -fno-omit-frame-pointer -g0 -fvisibility=hidden -Wheader-hygiene -Wstring-conversion -Wtautological-overlap-compare -Wenum-compare-conditional -Wno-c++11-narrowing-const-reference -std=c++20 -Wno-trigraphs -gsimple-template-names -fno-exceptions -fno-rtti -fvisibility-inlines-hidden  -Wno-unknown-warning-option -Wno-deprecated-declarations -Wno-unused-command-line-argument -Wno-unused-but-set-variable -Wno-unused-result -Wno-unused-function -Wno-unused-variable -Wno-unused-const-variable -Wno-unneeded-internal-declaration -Wno-unknown-attributes -DUSE_SYSTEM_MINIZIP -c ../../third_party/ruy/src/ruy/profiler/instrumentation.cc -o obj/third_party/ruy/ruy_instrumentation/instrumentation.o
[x86_64] In file included from ../../third_party/ruy/src/ruy/profiler/instrumentation.cc:16:
[x86_64] ../../third_party/ruy/src/ruy/profiler/instrumentation.h:55:8: error: no type named 'string' in namespace 'std'
[x86_64]    55 |   std::string Formatted() const;
[x86_64] ../../third_party/ruy/src/ruy/profiler/instrumentation.h:147:7: error: use of undeclared identifier 'abort'
[x86_64]   147 |       abort();
[x86_64] ../../third_party/ruy/src/ruy/profiler/instrumentation.cc:34:12: error: no member named 'string' in namespace 'std'
[x86_64]    34 |   if (std::string(format_) != std::string(other.format_)) {
[x86_64] ../../third_party/ruy/src/ruy/profiler/instrumentation.cc:34:36: error: no member named 'string' in namespace 'std'
[x86_64]    34 |   if (std::string(format_) != std::string(other.format_)) {
[x86_64] ../../third_party/ruy/src/ruy/profiler/instrumentation.cc:48:6: error: no type named 'string' in namespace 'std'
[x86_64]    48 | std::string Label::Formatted() const {
[x86_64] ../../third_party/ruy/src/ruy/profiler/instrumentation.cc:52:12: error: cannot initialize return object of type 'int' with an lvalue of type 'const char *const'
[x86_64]    52 |     return format_;
[x86_64] ../../third_party/ruy/src/ruy/profiler/instrumentation.cc:63:5: error: use of undeclared identifier 'abort'
[x86_64]    63 |     abort();
[x86_64] ../../third_party/ruy/src/ruy/profiler/instrumentation.cc:65:10: error: cannot initialize return object of type 'int' with an lvalue of type 'char[256]'
[x86_64]    65 |   return buf;
2024-May-23 15:01:16 :: [x86_64] chromium.git 125.0.6422.76-alt1: remote: build failed
2024-May-23 15:01:16 :: [x86_64] #100 chromium.git 125.0.6422.76-alt1: build FAILED
2024-May-23 15:01:17 :: [x86_64] requesting cancellation of task processing
[aarch64] [chrome 10233/60614] clang++ -MD -MF obj/third_party/ruy/ruy_instrumentation/instrumentation.o.d -DRUY_PROFILER -DUSE_UDEV -DUSE_AURA=1 -DUSE_GLIB=1 -DUSE_OZONE=1 -DOFFICIAL_BUILD -D__STDC_CONSTANT_MACROS -D__STDC_FORMAT_MACROS -D_FORTIFY_SOURCE=2 -D_FILE_OFFSET_BITS=64 -D_LARGEFILE_SOURCE -D_LARGEFILE64_SOURCE -DNO_UNWIND_TABLES -D_GNU_SOURCE -D_LIBCPP_HARDENING_MODE=_LIBCPP_HARDENING_MODE_NONE -D_GLIBCXX_ASSERTIONS=1 -DNDEBUG -DNVALGRIND -DDYNAMIC_ANNOTATIONS_ENABLED=0 -I../.. -Igen -I../../third_party/ruy/src -Wall -Wextra -Wimplicit-fallthrough -Wextra-semi -Wunreachable-code-aggressive -Wthread-safety -Wno-missing-field-initializers -Wno-unused-parameter -Wno-psabi -Wloop-analysis -Wno-unneeded-internal-declaration -Wno-cast-function-type -Wno-ignored-pragma-optimize -Wno-deprecated-builtins -Wno-bitfield-constant-conversion -Wno-deprecated-this-capture -Wno-invalid-offsetof -Wno-vla-extension -Wno-thread-safety-reference-return -Wshadow -fno-delete-null-pointer-checks -fno-ident -fno-strict-aliasing -fstack-protector -fno-unwind-tables -fno-asynchronous-unwind-tables -fPIC -pthread -fcolor-diagnostics -fmerge-all-constants -fcrash-diagnostics-dir=../../tools/clang/crashreports -mllvm -instcombine-lower-dbg-declare=0 -ffp-contract=off -flto=thin -fsplit-lto-unit -fwhole-program-vtables -mbranch-protection=standard --target=aarch64-linux-gnu -mno-outline -ftrivial-auto-var-init=pattern -O2 -fdata-sections -ffunction-sections -fno-unique-section-names -fno-math-errno -fno-omit-frame-pointer -g0 -fvisibility=hidden -Wheader-hygiene -Wstring-conversion -Wtautological-overlap-compare -Wno-inline-asm -Wenum-compare-conditional -Wno-c++11-narrowing-const-reference -std=c++20 -Wno-trigraphs -gsimple-template-names -fno-exceptions -fno-rtti -fvisibility-inlines-hidden  -Wno-unknown-warning-option -Wno-deprecated-declarations -Wno-unused-command-line-argument -Wno-unused-but-set-variable -Wno-unused-result -Wno-unused-function -Wno-unused-variable -Wno-unused-const-variable -Wno-unneeded-internal-declaration -Wno-unknown-attributes -DUSE_SYSTEM_MINIZIP -c ../../third_party/ruy/src/ruy/profiler/instrumentation.cc -o obj/third_party/ruy/ruy_instrumentation/instrumentation.o
[aarch64] FAILED: obj/third_party/ruy/ruy_instrumentation/instrumentation.o 
[aarch64] clang++ -MD -MF obj/third_party/ruy/ruy_instrumentation/instrumentation.o.d -DRUY_PROFILER -DUSE_UDEV -DUSE_AURA=1 -DUSE_GLIB=1 -DUSE_OZONE=1 -DOFFICIAL_BUILD -D__STDC_CONSTANT_MACROS -D__STDC_FORMAT_MACROS -D_FORTIFY_SOURCE=2 -D_FILE_OFFSET_BITS=64 -D_LARGEFILE_SOURCE -D_LARGEFILE64_SOURCE -DNO_UNWIND_TABLES -D_GNU_SOURCE -D_LIBCPP_HARDENING_MODE=_LIBCPP_HARDENING_MODE_NONE -D_GLIBCXX_ASSERTIONS=1 -DNDEBUG -DNVALGRIND -DDYNAMIC_ANNOTATIONS_ENABLED=0 -I../.. -Igen -I../../third_party/ruy/src -Wall -Wextra -Wimplicit-fallthrough -Wextra-semi -Wunreachable-code-aggressive -Wthread-safety -Wno-missing-field-initializers -Wno-unused-parameter -Wno-psabi -Wloop-analysis -Wno-unneeded-internal-declaration -Wno-cast-function-type -Wno-ignored-pragma-optimize -Wno-deprecated-builtins -Wno-bitfield-constant-conversion -Wno-deprecated-this-capture -Wno-invalid-offsetof -Wno-vla-extension -Wno-thread-safety-reference-return -Wshadow -fno-delete-null-pointer-checks -fno-ident -fno-strict-aliasing -fstack-protector -fno-unwind-tables -fno-asynchronous-unwind-tables -fPIC -pthread -fcolor-diagnostics -fmerge-all-constants -fcrash-diagnostics-dir=../../tools/clang/crashreports -mllvm -instcombine-lower-dbg-declare=0 -ffp-contract=off -flto=thin -fsplit-lto-unit -fwhole-program-vtables -mbranch-protection=standard --target=aarch64-linux-gnu -mno-outline -ftrivial-auto-var-init=pattern -O2 -fdata-sections -ffunction-sections -fno-unique-section-names -fno-math-errno -fno-omit-frame-pointer -g0 -fvisibility=hidden -Wheader-hygiene -Wstring-conversion -Wtautological-overlap-compare -Wno-inline-asm -Wenum-compare-conditional -Wno-c++11-narrowing-const-reference -std=c++20 -Wno-trigraphs -gsimple-template-names -fno-exceptions -fno-rtti -fvisibility-inlines-hidden  -Wno-unknown-warning-option -Wno-deprecated-declarations -Wno-unused-command-line-argument -Wno-unused-but-set-variable -Wno-unused-result -Wno-unused-function -Wno-unused-variable -Wno-unused-const-variable -Wno-unneeded-internal-declaration -Wno-unknown-attributes -DUSE_SYSTEM_MINIZIP -c ../../third_party/ruy/src/ruy/profiler/instrumentation.cc -o obj/third_party/ruy/ruy_instrumentation/instrumentation.o
[aarch64] In file included from ../../third_party/ruy/src/ruy/profiler/instrumentation.cc:16:
[aarch64] ../../third_party/ruy/src/ruy/profiler/instrumentation.h:55:8: error: no type named 'string' in namespace 'std'
[aarch64]    55 |   std::string Formatted() const;
[aarch64] ../../third_party/ruy/src/ruy/profiler/instrumentation.h:147:7: error: use of undeclared identifier 'abort'
[aarch64]   147 |       abort();
[aarch64] ../../third_party/ruy/src/ruy/profiler/instrumentation.cc:34:12: error: no member named 'string' in namespace 'std'
[aarch64]    34 |   if (std::string(format_) != std::string(other.format_)) {
[aarch64] ../../third_party/ruy/src/ruy/profiler/instrumentation.cc:34:36: error: no member named 'string' in namespace 'std'
[aarch64]    34 |   if (std::string(format_) != std::string(other.format_)) {
[aarch64] ../../third_party/ruy/src/ruy/profiler/instrumentation.cc:48:6: error: no type named 'string' in namespace 'std'
[aarch64]    48 | std::string Label::Formatted() const {
[aarch64] ../../third_party/ruy/src/ruy/profiler/instrumentation.cc:52:12: error: cannot initialize return object of type 'int' with an lvalue of type 'const char *const'
[aarch64]    52 |     return format_;
[aarch64] ../../third_party/ruy/src/ruy/profiler/instrumentation.cc:63:5: error: use of undeclared identifier 'abort'
[aarch64]    63 |     abort();
[aarch64] ../../third_party/ruy/src/ruy/profiler/instrumentation.cc:65:10: error: cannot initialize return object of type 'int' with an lvalue of type 'char[256]'
[aarch64]    65 |   return buf;
2024-May-23 15:08:49 :: [aarch64] chromium.git 125.0.6422.76-alt1: remote: build failed
2024-May-23 15:08:49 :: [aarch64] #100 chromium.git 125.0.6422.76-alt1: build FAILED
2024-May-23 15:01:17 :: [x86_64] build FAILED
2024-May-23 15:08:50 :: [aarch64] build FAILED
2024-May-23 15:08:50 :: task #348751 for sisyphus FAILED


More information about the Sisyphus-incominger mailing list