[#348737] [test-only] p10 FAILED util-linux.git=2.39.2-alt0.p10.2
Girar awaiter (felixz)
girar-builder at altlinux.org
Thu May 23 14:42:20 MSK 2024
https://git.altlinux.org/tasks/348737/logs/events.1.1.log
subtask name aarch64 armh i586 ppc64le x86_64
#100 util-linux failed failed failed failed failed
2024-May-23 11:40:55 :: test-only task #348737 for p10 started by felixz:
2024-May-23 11:40:55 :: message: fix_CVE-2024-28085
#100 build 2.39.2-alt0.p10.2 from /people/felixz/packages/util-linux.git fetched at 2024-May-23 11:40:53
2024-May-23 11:40:56 :: [armh] #100 util-linux.git 2.39.2-alt0.p10.2: build start
2024-May-23 11:40:56 :: [i586] #100 util-linux.git 2.39.2-alt0.p10.2: build start
2024-May-23 11:40:56 :: [x86_64] #100 util-linux.git 2.39.2-alt0.p10.2: build start
2024-May-23 11:40:56 :: [aarch64] #100 util-linux.git 2.39.2-alt0.p10.2: build start
2024-May-23 11:40:56 :: [ppc64le] #100 util-linux.git 2.39.2-alt0.p10.2: build start
[x86_64] patching file term-utils/wall.c
[x86_64] Hunk #1 FAILED at 368.
[x86_64] 1 out of 1 hunk FAILED -- saving rejects to file term-utils/wall.c.rej
2024-May-23 11:41:28 :: [x86_64] util-linux.git 2.39.2-alt0.p10.2: remote: build failed
2024-May-23 11:41:28 :: [x86_64] #100 util-linux.git 2.39.2-alt0.p10.2: build FAILED
2024-May-23 11:41:28 :: [x86_64] requesting cancellation of task processing
[i586] patching file term-utils/wall.c
[i586] Hunk #1 FAILED at 368.
[i586] 1 out of 1 hunk FAILED -- saving rejects to file term-utils/wall.c.rej
2024-May-23 11:41:31 :: [i586] util-linux.git 2.39.2-alt0.p10.2: remote: build failed
2024-May-23 11:41:31 :: [i586] #100 util-linux.git 2.39.2-alt0.p10.2: build FAILED
[aarch64] patching file term-utils/wall.c
[aarch64] Hunk #1 FAILED at 368.
[aarch64] 1 out of 1 hunk FAILED -- saving rejects to file term-utils/wall.c.rej
2024-May-23 11:41:55 :: [aarch64] util-linux.git 2.39.2-alt0.p10.2: remote: build failed
2024-May-23 11:41:55 :: [aarch64] #100 util-linux.git 2.39.2-alt0.p10.2: build FAILED
[ppc64le] patching file term-utils/wall.c
[ppc64le] Hunk #1 FAILED at 368.
[ppc64le] 1 out of 1 hunk FAILED -- saving rejects to file term-utils/wall.c.rej
2024-May-23 11:41:58 :: [ppc64le] util-linux.git 2.39.2-alt0.p10.2: remote: build failed
2024-May-23 11:41:58 :: [ppc64le] #100 util-linux.git 2.39.2-alt0.p10.2: build FAILED
[armh] patching file term-utils/wall.c
[armh] Hunk #1 FAILED at 368.
[armh] 1 out of 1 hunk FAILED -- saving rejects to file term-utils/wall.c.rej
2024-May-23 11:42:19 :: [armh] util-linux.git 2.39.2-alt0.p10.2: remote: build failed
2024-May-23 11:42:19 :: [armh] #100 util-linux.git 2.39.2-alt0.p10.2: build FAILED
2024-May-23 11:41:28 :: [x86_64] build FAILED
2024-May-23 11:41:32 :: [i586] build FAILED
2024-May-23 11:41:55 :: [aarch64] build FAILED
2024-May-23 11:41:58 :: [ppc64le] build FAILED
2024-May-23 11:42:19 :: [armh] build FAILED
2024-May-23 11:42:19 :: task #348737 for p10 FAILED
More information about the Sisyphus-incominger
mailing list