[#348244] [test-only] FAILED checkrpms.git=1.0.2-alt1

Girar awaiter (nit) girar-builder at altlinux.org
Fri May 17 06:07:56 MSK 2024


https://git.altlinux.org/tasks/348244/logs/events.1.1.log

subtask  name       aarch64    i586  ppc64le  x86_64
   #100  checkrpms   failed  failed   failed  failed

2024-May-17 03:07:28 :: test-only task #348244 for sisyphus started by nit:
#100 build 1.0.2-alt1 from /people/nit/packages/checkrpms.git fetched at 2024-May-17 03:07:21
2024-May-17 03:07:30 :: [aarch64] #100 checkrpms.git 1.0.2-alt1: build start
2024-May-17 03:07:30 :: [ppc64le] #100 checkrpms.git 1.0.2-alt1: build start
2024-May-17 03:07:30 :: [x86_64] #100 checkrpms.git 1.0.2-alt1: build start
2024-May-17 03:07:30 :: [i586] #100 checkrpms.git 1.0.2-alt1: build start
[i586] <13>May 17 03:07:44 rpmi: libncurses6-6.3.20220618-alt4 sisyphus+327286.4600.14.1 1711486782 installed
[i586] <13>May 17 03:07:44 rpmi: libtinfo-devel-6.3.20220618-alt4 sisyphus+327286.4600.14.1 1711486782 installed
[i586] <13>May 17 03:07:44 rpmi: libncurses-devel-6.3.20220618-alt4 sisyphus+327286.4600.14.1 1711486782 installed
[i586] <13>May 17 03:07:44 rpmi: libmpdec3-2.5.1-alt3 sisyphus+314490.500.5.1 1675432033 installed
[i586] <13>May 17 03:07:44 rpmi: libgdbm-1.8.3-alt10 sisyphus+278100.1600.1.1 1626059138 installed
[i586] <13>May 17 03:07:44 rpmi: libexpat-2.5.0-alt1 sisyphus+309227.100.1.1 1667075766 installed
[i586] <13>May 17 03:07:44 rpmi: libb2-0.98.1-alt1_1 sisyphus+291614.100.1.1 1638962878 installed
[i586] <13>May 17 03:07:44 rpmi: libp11-kit-1:0.25.3-alt2 sisyphus+336533.100.1.1 1702645575 installed
[i586] <13>May 17 03:07:44 rpmi: libtasn1-4.19.0-alt3 sisyphus+327816.100.1.1 1692802618 installed
[i586] <13>May 17 03:07:44 rpmi: rpm-macros-alternatives-0.5.2-alt2 sisyphus+315270.200.2.1 1676457367 installed
[i586] <13>May 17 03:07:44 rpmi: alternatives-0.5.2-alt2 sisyphus+315270.200.2.1 1676457367 installed
[i586] <13>May 17 03:07:44 rpmi: ca-certificates-2024.02.24-alt1 sisyphus+341362.100.1.1 1708791001 installed
[i586] <13>May 17 03:07:44 rpmi: ca-trust-0.2.0-alt1 sisyphus+344843.100.1.1 1712743326 installed
[i586] <13>May 17 03:07:44 rpmi: p11-kit-trust-1:0.25.3-alt2 sisyphus+336533.100.1.1 1702645575 installed
[i586] <13>May 17 03:07:44 rpmi: libcrypto3-3.1.5-alt2 sisyphus+343320.140.3.1 1711982452 installed
[i586] <13>May 17 03:07:44 rpmi: libssl3-3.1.5-alt2 sisyphus+343320.140.3.1 1711982452 installed
[i586] <13>May 17 03:07:44 rpmi: python3-3.12.2-alt1 sisyphus+341702.200.1.1 1709232959 installed
[i586] <13>May 17 03:07:45 rpmi: python3-base-3.12.2-alt1 sisyphus+341702.200.1.1 1709232959 installed
[i586] <13>May 17 03:07:45 rpmi: libpython3-3.12.2-alt1 sisyphus+341702.200.1.1 1709232959 installed
[i586] <13>May 17 03:07:45 rpmi: python3-module-py3dephell-0.1.0-alt2 sisyphus+328191.600.5.1 1693609196 installed
[i586] <13>May 17 03:07:45 rpmi: python3-module-pkg_resources-1:69.5.1-alt1 sisyphus+345209.100.2.1 1713349328 installed
[i586] <13>May 17 03:07:45 rpmi: tests-for-installed-python3-pkgs-0.1.25-alt1 sisyphus+344685.100.1.1 1712595070 installed
[i586] <13>May 17 03:07:45 rpmi: rpm-build-python3-0.1.25-alt1 sisyphus+344685.100.1.1 1712595070 installed
[i586] <13>May 17 03:07:46 rpmi: python3-dev-3.12.2-alt1 sisyphus+341702.200.1.1 1709232959 installed
[i586] <13>May 17 03:07:46 rpmi: python3-module-setuptools-1:69.5.1-alt1 sisyphus+345209.100.2.1 1713349328 installed
[i586] <13>May 17 03:07:46 rpmi: python3-module-wheel-0.43.0-alt1 sisyphus+342546.200.3.1 1710867409 installed
[i586] error: File /usr/src/in/source/checkrpms.tar: No such file or directory
[i586] Building target platforms: i586
[i586] Building for target i586
[i586] hsh-rebuild: pkg.tar: failed to create src.rpm file
2024-May-17 03:07:47 :: [i586] checkrpms.git 1.0.2-alt1: remote: cannot build src.rpm
2024-May-17 03:07:47 :: [i586] #100 checkrpms.git 1.0.2-alt1: build FAILED
2024-May-17 03:07:47 :: [i586] requesting cancellation of task processing
[x86_64] <13>May 17 03:07:50 rpmi: libncurses6-6.3.20220618-alt4 sisyphus+327286.4600.14.1 1711486705 installed
[x86_64] <13>May 17 03:07:50 rpmi: libtinfo-devel-6.3.20220618-alt4 sisyphus+327286.4600.14.1 1711486705 installed
[x86_64] <13>May 17 03:07:50 rpmi: libncurses-devel-6.3.20220618-alt4 sisyphus+327286.4600.14.1 1711486705 installed
[x86_64] <13>May 17 03:07:50 rpmi: libmpdec3-2.5.1-alt3 sisyphus+314490.500.5.1 1675432004 installed
[x86_64] <13>May 17 03:07:50 rpmi: libgdbm-1.8.3-alt10 sisyphus+278100.1600.1.1 1626058413 installed
[x86_64] <13>May 17 03:07:50 rpmi: libexpat-2.5.0-alt1 sisyphus+309227.100.1.1 1667075764 installed
[x86_64] <13>May 17 03:07:50 rpmi: libb2-0.98.1-alt1_1 sisyphus+291614.100.1.1 1638962877 installed
[x86_64] <13>May 17 03:07:50 rpmi: libp11-kit-1:0.25.3-alt2 sisyphus+336533.100.1.1 1702645560 installed
[x86_64] <13>May 17 03:07:50 rpmi: libtasn1-4.19.0-alt3 sisyphus+327816.100.1.1 1692802615 installed
[x86_64] <13>May 17 03:07:50 rpmi: rpm-macros-alternatives-0.5.2-alt2 sisyphus+315270.200.2.1 1676457367 installed
[x86_64] <13>May 17 03:07:50 rpmi: alternatives-0.5.2-alt2 sisyphus+315270.200.2.1 1676457367 installed
[x86_64] <13>May 17 03:07:50 rpmi: ca-certificates-2024.02.24-alt1 sisyphus+341362.100.1.1 1708791001 installed
[x86_64] <13>May 17 03:07:50 rpmi: ca-trust-0.2.0-alt1 sisyphus+344843.100.1.1 1712743326 installed
[x86_64] <13>May 17 03:07:50 rpmi: p11-kit-trust-1:0.25.3-alt2 sisyphus+336533.100.1.1 1702645560 installed
[x86_64] <13>May 17 03:07:50 rpmi: libcrypto3-3.1.5-alt2 sisyphus+343320.140.3.1 1711982212 installed
[x86_64] <13>May 17 03:07:50 rpmi: libssl3-3.1.5-alt2 sisyphus+343320.140.3.1 1711982212 installed
[x86_64] <13>May 17 03:07:50 rpmi: python3-3.12.2-alt1 sisyphus+341702.200.1.1 1709232871 installed
[x86_64] <13>May 17 03:07:51 rpmi: python3-base-3.12.2-alt1 sisyphus+341702.200.1.1 1709232871 installed
[x86_64] <13>May 17 03:07:51 rpmi: libpython3-3.12.2-alt1 sisyphus+341702.200.1.1 1709232871 installed
[x86_64] <13>May 17 03:07:51 rpmi: python3-module-py3dephell-0.1.0-alt2 sisyphus+328191.600.5.1 1693609196 installed
[x86_64] <13>May 17 03:07:51 rpmi: python3-module-pkg_resources-1:69.5.1-alt1 sisyphus+345209.100.2.1 1713349325 installed
[x86_64] <13>May 17 03:07:51 rpmi: tests-for-installed-python3-pkgs-0.1.25-alt1 sisyphus+344685.100.1.1 1712595070 installed
[x86_64] <13>May 17 03:07:51 rpmi: rpm-build-python3-0.1.25-alt1 sisyphus+344685.100.1.1 1712595070 installed
[x86_64] <13>May 17 03:07:52 rpmi: python3-dev-3.12.2-alt1 sisyphus+341702.200.1.1 1709232871 installed
[x86_64] <13>May 17 03:07:52 rpmi: python3-module-setuptools-1:69.5.1-alt1 sisyphus+345209.100.2.1 1713349325 installed
[x86_64] <13>May 17 03:07:52 rpmi: python3-module-wheel-0.43.0-alt1 sisyphus+342546.200.3.1 1710867409 installed
[x86_64] error: File /usr/src/in/source/checkrpms.tar: No such file or directory
[x86_64] Building target platforms: x86_64
[x86_64] Building for target x86_64
[x86_64] hsh-rebuild: pkg.tar: failed to create src.rpm file
2024-May-17 03:07:52 :: [x86_64] checkrpms.git 1.0.2-alt1: remote: cannot build src.rpm
2024-May-17 03:07:52 :: [x86_64] #100 checkrpms.git 1.0.2-alt1: build FAILED
[aarch64] <13>May 17 03:07:49 rpmi: libncurses6-6.3.20220618-alt4 sisyphus+327286.4600.14.1 1711487513 installed
[aarch64] <13>May 17 03:07:49 rpmi: libtinfo-devel-6.3.20220618-alt4 sisyphus+327286.4600.14.1 1711487513 installed
[aarch64] <13>May 17 03:07:49 rpmi: libncurses-devel-6.3.20220618-alt4 sisyphus+327286.4600.14.1 1711487513 installed
[aarch64] <13>May 17 03:07:49 rpmi: libmpdec3-2.5.1-alt3 sisyphus+314490.500.5.1 1675432086 installed
[aarch64] <13>May 17 03:07:49 rpmi: libgdbm-1.8.3-alt10 sisyphus+278100.1600.1.1 1626059407 installed
[aarch64] <13>May 17 03:07:49 rpmi: libexpat-2.5.0-alt1 sisyphus+309227.100.1.1 1667075787 installed
[aarch64] <13>May 17 03:07:49 rpmi: libb2-0.98.1-alt1_1 sisyphus+291614.100.1.1 1638962893 installed
[aarch64] <13>May 17 03:07:49 rpmi: libp11-kit-1:0.25.3-alt2 sisyphus+336533.100.1.1 1702645719 installed
[aarch64] <13>May 17 03:07:49 rpmi: libtasn1-4.19.0-alt3 sisyphus+327816.100.1.1 1692802654 installed
[aarch64] <13>May 17 03:07:49 rpmi: rpm-macros-alternatives-0.5.2-alt2 sisyphus+315270.200.2.1 1676457367 installed
[aarch64] <13>May 17 03:07:49 rpmi: alternatives-0.5.2-alt2 sisyphus+315270.200.2.1 1676457367 installed
[aarch64] <13>May 17 03:07:49 rpmi: ca-certificates-2024.02.24-alt1 sisyphus+341362.100.1.1 1708791001 installed
[aarch64] <13>May 17 03:07:49 rpmi: ca-trust-0.2.0-alt1 sisyphus+344843.100.1.1 1712743326 installed
[aarch64] <13>May 17 03:07:50 rpmi: p11-kit-trust-1:0.25.3-alt2 sisyphus+336533.100.1.1 1702645719 installed
[aarch64] <13>May 17 03:07:50 rpmi: libcrypto3-3.1.5-alt2 sisyphus+343320.140.3.1 1711982625 installed
[aarch64] <13>May 17 03:07:50 rpmi: libssl3-3.1.5-alt2 sisyphus+343320.140.3.1 1711982625 installed
[aarch64] <13>May 17 03:07:50 rpmi: python3-3.12.2-alt1 sisyphus+341702.200.1.1 1709234667 installed
[aarch64] <13>May 17 03:07:51 rpmi: python3-base-3.12.2-alt1 sisyphus+341702.200.1.1 1709234667 installed
[aarch64] <13>May 17 03:07:51 rpmi: libpython3-3.12.2-alt1 sisyphus+341702.200.1.1 1709234667 installed
[aarch64] <13>May 17 03:07:51 rpmi: python3-module-py3dephell-0.1.0-alt2 sisyphus+328191.600.5.1 1693609196 installed
[aarch64] <13>May 17 03:07:51 rpmi: python3-module-pkg_resources-1:69.5.1-alt1 sisyphus+345209.100.2.1 1713349383 installed
[aarch64] <13>May 17 03:07:51 rpmi: tests-for-installed-python3-pkgs-0.1.25-alt1 sisyphus+344685.100.1.1 1712595070 installed
[aarch64] <13>May 17 03:07:51 rpmi: rpm-build-python3-0.1.25-alt1 sisyphus+344685.100.1.1 1712595070 installed
[aarch64] <13>May 17 03:07:52 rpmi: python3-dev-3.12.2-alt1 sisyphus+341702.200.1.1 1709234667 installed
[aarch64] <13>May 17 03:07:52 rpmi: python3-module-setuptools-1:69.5.1-alt1 sisyphus+345209.100.2.1 1713349383 installed
[aarch64] <13>May 17 03:07:52 rpmi: python3-module-wheel-0.43.0-alt1 sisyphus+342546.200.3.1 1710867468 installed
[aarch64] error: File /usr/src/in/source/checkrpms.tar: No such file or directory
[aarch64] Building target platforms: aarch64
[aarch64] Building for target aarch64
[aarch64] hsh-rebuild: pkg.tar: failed to create src.rpm file
2024-May-17 03:07:53 :: [aarch64] checkrpms.git 1.0.2-alt1: remote: cannot build src.rpm
2024-May-17 03:07:53 :: [aarch64] #100 checkrpms.git 1.0.2-alt1: build FAILED
[ppc64le] <13>May 17 03:07:51 rpmi: libncurses6-6.3.20220618-alt4 sisyphus+327286.4600.14.1 1711487737 installed
[ppc64le] <13>May 17 03:07:51 rpmi: libtinfo-devel-6.3.20220618-alt4 sisyphus+327286.4600.14.1 1711487737 installed
[ppc64le] <13>May 17 03:07:51 rpmi: libncurses-devel-6.3.20220618-alt4 sisyphus+327286.4600.14.1 1711487737 installed
[ppc64le] <13>May 17 03:07:51 rpmi: libmpdec3-2.5.1-alt3 sisyphus+314490.500.5.1 1675432129 installed
[ppc64le] <13>May 17 03:07:51 rpmi: libgdbm-1.8.3-alt10 sisyphus+278100.1600.1.1 1626061027 installed
[ppc64le] <13>May 17 03:07:51 rpmi: libexpat-2.5.0-alt1 sisyphus+309227.100.1.1 1667075799 installed
[ppc64le] <13>May 17 03:07:51 rpmi: libb2-0.98.1-alt1_1 sisyphus+291614.100.1.1 1638962899 installed
[ppc64le] <13>May 17 03:07:51 rpmi: libp11-kit-1:0.25.3-alt2 sisyphus+336533.100.1.1 1702645751 installed
[ppc64le] <13>May 17 03:07:51 rpmi: libtasn1-4.19.0-alt3 sisyphus+327816.100.1.1 1692802672 installed
[ppc64le] <13>May 17 03:07:51 rpmi: rpm-macros-alternatives-0.5.2-alt2 sisyphus+315270.200.2.1 1676457367 installed
[ppc64le] <13>May 17 03:07:51 rpmi: alternatives-0.5.2-alt2 sisyphus+315270.200.2.1 1676457367 installed
[ppc64le] <13>May 17 03:07:51 rpmi: ca-certificates-2024.02.24-alt1 sisyphus+341362.100.1.1 1708791001 installed
[ppc64le] <13>May 17 03:07:51 rpmi: ca-trust-0.2.0-alt1 sisyphus+344843.100.1.1 1712743326 installed
[ppc64le] <13>May 17 03:07:51 rpmi: p11-kit-trust-1:0.25.3-alt2 sisyphus+336533.100.1.1 1702645751 installed
[ppc64le] <13>May 17 03:07:52 rpmi: libcrypto3-3.1.5-alt2 sisyphus+343320.140.3.1 1711982805 installed
[ppc64le] <13>May 17 03:07:52 rpmi: libssl3-3.1.5-alt2 sisyphus+343320.140.3.1 1711982805 installed
[ppc64le] <13>May 17 03:07:52 rpmi: python3-3.12.2-alt1 sisyphus+341702.200.1.1 1709234791 installed
[ppc64le] <13>May 17 03:07:53 rpmi: python3-base-3.12.2-alt1 sisyphus+341702.200.1.1 1709234791 installed
[ppc64le] <13>May 17 03:07:53 rpmi: libpython3-3.12.2-alt1 sisyphus+341702.200.1.1 1709234791 installed
[ppc64le] <13>May 17 03:07:53 rpmi: python3-module-py3dephell-0.1.0-alt2 sisyphus+328191.600.5.1 1693609196 installed
[ppc64le] <13>May 17 03:07:53 rpmi: python3-module-pkg_resources-1:69.5.1-alt1 sisyphus+345209.100.2.1 1713349376 installed
[ppc64le] <13>May 17 03:07:53 rpmi: tests-for-installed-python3-pkgs-0.1.25-alt1 sisyphus+344685.100.1.1 1712595070 installed
[ppc64le] <13>May 17 03:07:53 rpmi: rpm-build-python3-0.1.25-alt1 sisyphus+344685.100.1.1 1712595070 installed
[ppc64le] <13>May 17 03:07:54 rpmi: python3-dev-3.12.2-alt1 sisyphus+341702.200.1.1 1709234791 installed
[ppc64le] <13>May 17 03:07:54 rpmi: python3-module-setuptools-1:69.5.1-alt1 sisyphus+345209.100.2.1 1713349376 installed
[ppc64le] <13>May 17 03:07:54 rpmi: python3-module-wheel-0.43.0-alt1 sisyphus+342546.200.3.1 1710867453 installed
[ppc64le] error: File /usr/src/in/source/checkrpms.tar: No such file or directory
[ppc64le] Building target platforms: ppc64le
[ppc64le] Building for target ppc64le
[ppc64le] hsh-rebuild: pkg.tar: failed to create src.rpm file
2024-May-17 03:07:55 :: [ppc64le] checkrpms.git 1.0.2-alt1: remote: cannot build src.rpm
2024-May-17 03:07:55 :: [ppc64le] #100 checkrpms.git 1.0.2-alt1: build FAILED
2024-May-17 03:07:47 :: [i586] build FAILED
2024-May-17 03:07:53 :: [x86_64] build FAILED
2024-May-17 03:07:53 :: [aarch64] build FAILED
2024-May-17 03:07:56 :: [ppc64le] build FAILED
2024-May-17 03:07:56 :: task #348244 for sisyphus FAILED


More information about the Sisyphus-incominger mailing list