[#344733] FAILED (try 15) mopidy.git=3.4.2-alt1 iris.git=3.69.3-alt1 mopidy-local.git=3.2.1-alt1

Girar awaiter (lola) girar-builder at altlinux.org
Mon Jun 24 14:50:12 MSK 2024


https://git.altlinux.org/tasks/344733/logs/events.15.1.log

subtask  name          aarch64    i586  ppc64le  x86_64
  #2700  mopidy-local   failed  failed        ?  failed

2024-Jun-24 11:48:13 :: task #344733 for sisyphus resumed by lola:
#100 removed
#200 removed
#300 removed
#400 removed
#500 removed
#600 removed
#700 removed
#1000 removed
#1100 removed
#1200 removed
#1300 removed
#1400 removed
#1500 removed
#1600 removed
#1700 removed
#2000 removed
#2100 removed
#2200 removed
#2300 build 3.4.2-alt1 from /people/lola/packages/mopidy.git fetched at 2024-Jun-24 11:20:59
#2400 removed
#2500 build 3.69.3-alt1 from /people/lola/packages/iris.git fetched at 2024-Jun-24 11:21:59
#2600 removed
#2700 build 3.2.1-alt1 from /people/lola/packages/mopidy-local.git fetched at 2024-Jun-24 11:48:05
2024-Jun-24 11:48:13 :: created build repo
2024-Jun-24 11:48:15 :: [x86_64] #2300 mopidy.git 3.4.2-alt1: build start
2024-Jun-24 11:48:15 :: [aarch64] #2300 mopidy.git 3.4.2-alt1: build start
2024-Jun-24 11:48:15 :: [i586] #2300 mopidy.git 3.4.2-alt1: build start
2024-Jun-24 11:48:15 :: [ppc64le] #2300 mopidy.git 3.4.2-alt1: build start
2024-Jun-24 11:48:33 :: [i586] #2300 mopidy.git 3.4.2-alt1: build OK (cached)
2024-Jun-24 11:48:34 :: [i586] #2500 iris.git 3.69.3-alt1: build start
2024-Jun-24 11:48:34 :: [x86_64] #2300 mopidy.git 3.4.2-alt1: build OK (cached)
2024-Jun-24 11:48:35 :: [x86_64] #2500 iris.git 3.69.3-alt1: build start
2024-Jun-24 11:48:48 :: [i586] #2500 iris.git 3.69.3-alt1: build OK (cached)
2024-Jun-24 11:48:48 :: [i586] #2700 mopidy-local.git 3.2.1-alt1: build start
2024-Jun-24 11:48:49 :: [x86_64] #2500 iris.git 3.69.3-alt1: build OK (cached)
2024-Jun-24 11:48:49 :: [x86_64] #2700 mopidy-local.git 3.2.1-alt1: build start
2024-Jun-24 11:48:50 :: [aarch64] #2300 mopidy.git 3.4.2-alt1: build OK (cached)
2024-Jun-24 11:48:50 :: [aarch64] #2500 iris.git 3.69.3-alt1: build start
2024-Jun-24 11:48:58 :: [ppc64le] #2300 mopidy.git 3.4.2-alt1: build OK (cached)
2024-Jun-24 11:48:58 :: [ppc64le] #2500 iris.git 3.69.3-alt1: build start
2024-Jun-24 11:49:15 :: [aarch64] #2500 iris.git 3.69.3-alt1: build OK (cached)
2024-Jun-24 11:49:15 :: [aarch64] #2700 mopidy-local.git 3.2.1-alt1: build start
2024-Jun-24 11:49:24 :: [ppc64le] #2500 iris.git 3.69.3-alt1: build OK (cached)
[x86_64]     raise AttributeError(f"{self} has no attribute {name!r}")
[x86_64] AttributeError: <ActorProxy for DummyAudio (urn:uuid:829966fc-ff4d-4b1f-ab1b-2c6566a601d2), attr_path=()> has no attribute 'set_source_setup_callback'
[x86_64] WARNING  mopidy.core.tracklist:tracklist.py:579 Track is not playable: local:track:song3.wav
[x86_64] --
[x86_64] >       assert self.playback.get_state().get() == state
[x86_64] E       AssertionError: assert 'stopped' == 'playing'
[x86_64] E         
[x86_64] --
[x86_64] ------------------------------ Captured log call -------------------------------
[x86_64] ERROR    mopidy.core.playback:playback.py:355 LocalBackend backend caused an exception.
[x86_64] Traceback (most recent call last):
[x86_64] --
[x86_64]     raise AttributeError(f"{self} has no attribute {name!r}")
[x86_64] AttributeError: <ActorProxy for DummyAudio (urn:uuid:bc5cdffc-4b92-4aa3-b7de-376986913cdf), attr_path=()> has no attribute 'set_source_setup_callback'
[x86_64] WARNING  mopidy.core.tracklist:tracklist.py:579 Track is not playable: local:track:song1.wav
[x86_64] ERROR    mopidy.core.playback:playback.py:355 LocalBackend backend caused an exception.
[x86_64] Traceback (most recent call last):
[x86_64] --
[x86_64]     raise AttributeError(f"{self} has no attribute {name!r}")
[x86_64] AttributeError: <ActorProxy for DummyAudio (urn:uuid:bc5cdffc-4b92-4aa3-b7de-376986913cdf), attr_path=()> has no attribute 'set_source_setup_callback'
[x86_64] WARNING  mopidy.core.tracklist:tracklist.py:579 Track is not playable: local:track:song2.wav
[x86_64] ERROR    mopidy.core.playback:playback.py:355 LocalBackend backend caused an exception.
[x86_64] Traceback (most recent call last):
[x86_64] --
[x86_64]     raise AttributeError(f"{self} has no attribute {name!r}")
[x86_64] AttributeError: <ActorProxy for DummyAudio (urn:uuid:bc5cdffc-4b92-4aa3-b7de-376986913cdf), attr_path=()> has no attribute 'set_source_setup_callback'
[x86_64] WARNING  mopidy.core.tracklist:tracklist.py:579 Track is not playable: local:track:song3.wav
[x86_64] --
[x86_64] =========================== short test summary info ============================
[x86_64] FAILED tests/test_playback.py::LocalPlaybackProviderTest::test_about_to_finish_after_previous
[x86_64] FAILED tests/test_playback.py::LocalPlaybackProviderTest::test_current_track_after_next
[x86_64] FAILED tests/test_playback.py::LocalPlaybackProviderTest::test_current_track_during_play
2024-Jun-24 11:49:24 :: [x86_64] mopidy-local.git 3.2.1-alt1: remote: build failed
2024-Jun-24 11:49:24 :: [x86_64] #2700 mopidy-local.git 3.2.1-alt1: build FAILED
2024-Jun-24 11:49:24 :: [x86_64] requesting cancellation of task processing
2024-Jun-24 11:49:25 :: [ppc64le] task processing CANCELLED
[i586]     raise AttributeError(f"{self} has no attribute {name!r}")
[i586] AttributeError: <ActorProxy for DummyAudio (urn:uuid:3e3d74fd-a3d4-4147-8a31-47138bd884a5), attr_path=()> has no attribute 'set_source_setup_callback'
[i586] WARNING  mopidy.core.tracklist:tracklist.py:579 Track is not playable: local:track:song3.wav
[i586] --
[i586] >       assert self.playback.get_state().get() == state
[i586] E       AssertionError: assert 'stopped' == 'playing'
[i586] E         
[i586] --
[i586] ------------------------------ Captured log call -------------------------------
[i586] ERROR    mopidy.core.playback:playback.py:355 LocalBackend backend caused an exception.
[i586] Traceback (most recent call last):
[i586] --
[i586]     raise AttributeError(f"{self} has no attribute {name!r}")
[i586] AttributeError: <ActorProxy for DummyAudio (urn:uuid:1f253e03-35e8-4164-aba8-ac84548d5f24), attr_path=()> has no attribute 'set_source_setup_callback'
[i586] WARNING  mopidy.core.tracklist:tracklist.py:579 Track is not playable: local:track:song1.wav
[i586] ERROR    mopidy.core.playback:playback.py:355 LocalBackend backend caused an exception.
[i586] Traceback (most recent call last):
[i586] --
[i586]     raise AttributeError(f"{self} has no attribute {name!r}")
[i586] AttributeError: <ActorProxy for DummyAudio (urn:uuid:1f253e03-35e8-4164-aba8-ac84548d5f24), attr_path=()> has no attribute 'set_source_setup_callback'
[i586] WARNING  mopidy.core.tracklist:tracklist.py:579 Track is not playable: local:track:song2.wav
[i586] ERROR    mopidy.core.playback:playback.py:355 LocalBackend backend caused an exception.
[i586] Traceback (most recent call last):
[i586] --
[i586]     raise AttributeError(f"{self} has no attribute {name!r}")
[i586] AttributeError: <ActorProxy for DummyAudio (urn:uuid:1f253e03-35e8-4164-aba8-ac84548d5f24), attr_path=()> has no attribute 'set_source_setup_callback'
[i586] WARNING  mopidy.core.tracklist:tracklist.py:579 Track is not playable: local:track:song3.wav
[i586] --
[i586] =========================== short test summary info ============================
[i586] FAILED tests/test_playback.py::LocalPlaybackProviderTest::test_about_to_finish_after_previous
[i586] FAILED tests/test_playback.py::LocalPlaybackProviderTest::test_current_track_after_next
[i586] FAILED tests/test_playback.py::LocalPlaybackProviderTest::test_current_track_during_play
2024-Jun-24 11:49:25 :: [i586] mopidy-local.git 3.2.1-alt1: remote: build failed
2024-Jun-24 11:49:25 :: [i586] #2700 mopidy-local.git 3.2.1-alt1: build FAILED
[aarch64]     raise AttributeError(f"{self} has no attribute {name!r}")
[aarch64] AttributeError: <ActorProxy for DummyAudio (urn:uuid:d2841401-cfcd-4e77-a3f7-378202fc25fd), attr_path=()> has no attribute 'set_source_setup_callback'
[aarch64] WARNING  mopidy.core.tracklist:tracklist.py:579 Track is not playable: local:track:song3.wav
[aarch64] --
[aarch64] >       assert self.playback.get_state().get() == state
[aarch64] E       AssertionError: assert 'stopped' == 'playing'
[aarch64] E         
[aarch64] --
[aarch64] ------------------------------ Captured log call -------------------------------
[aarch64] ERROR    mopidy.core.playback:playback.py:355 LocalBackend backend caused an exception.
[aarch64] Traceback (most recent call last):
[aarch64] --
[aarch64]     raise AttributeError(f"{self} has no attribute {name!r}")
[aarch64] AttributeError: <ActorProxy for DummyAudio (urn:uuid:448d9eeb-67cb-4eb4-941b-239fa8efca1b), attr_path=()> has no attribute 'set_source_setup_callback'
[aarch64] WARNING  mopidy.core.tracklist:tracklist.py:579 Track is not playable: local:track:song1.wav
[aarch64] ERROR    mopidy.core.playback:playback.py:355 LocalBackend backend caused an exception.
[aarch64] Traceback (most recent call last):
[aarch64] --
[aarch64]     raise AttributeError(f"{self} has no attribute {name!r}")
[aarch64] AttributeError: <ActorProxy for DummyAudio (urn:uuid:448d9eeb-67cb-4eb4-941b-239fa8efca1b), attr_path=()> has no attribute 'set_source_setup_callback'
[aarch64] WARNING  mopidy.core.tracklist:tracklist.py:579 Track is not playable: local:track:song2.wav
[aarch64] ERROR    mopidy.core.playback:playback.py:355 LocalBackend backend caused an exception.
[aarch64] Traceback (most recent call last):
[aarch64] --
[aarch64]     raise AttributeError(f"{self} has no attribute {name!r}")
[aarch64] AttributeError: <ActorProxy for DummyAudio (urn:uuid:448d9eeb-67cb-4eb4-941b-239fa8efca1b), attr_path=()> has no attribute 'set_source_setup_callback'
[aarch64] WARNING  mopidy.core.tracklist:tracklist.py:579 Track is not playable: local:track:song3.wav
[aarch64] --
[aarch64] =========================== short test summary info ============================
[aarch64] FAILED tests/test_playback.py::LocalPlaybackProviderTest::test_about_to_finish_after_previous
[aarch64] FAILED tests/test_playback.py::LocalPlaybackProviderTest::test_current_track_after_next
[aarch64] FAILED tests/test_playback.py::LocalPlaybackProviderTest::test_current_track_during_play
2024-Jun-24 11:50:11 :: [aarch64] mopidy-local.git 3.2.1-alt1: remote: build failed
2024-Jun-24 11:50:11 :: [aarch64] #2700 mopidy-local.git 3.2.1-alt1: build FAILED
2024-Jun-24 11:49:25 :: [x86_64] build FAILED
2024-Jun-24 11:49:25 :: [ppc64le] build FAILED
2024-Jun-24 11:49:25 :: [i586] build FAILED
2024-Jun-24 11:50:11 :: [aarch64] build FAILED
2024-Jun-24 11:50:12 :: task #344733 for sisyphus FAILED


More information about the Sisyphus-incominger mailing list