[#338343] [test-only] FAILED sssd.git=2.9.4-alt1
Girar awaiter (sin)
girar-builder at altlinux.org
Wed Jan 17 01:45:23 MSK 2024
https://git.altlinux.org/tasks/338343/logs/events.1.1.log
subtask name aarch64 armh i586 ppc64le x86_64
#100 sssd failed failed failed failed failed
2024-Jan-16 22:43:40 :: test-only task #338343 for sisyphus started by sin:
#100 build 2.9.4-alt1 from /people/sin/packages/sssd.git fetched at 2024-Jan-16 22:43:38
2024-Jan-16 22:43:41 :: [i586] #100 sssd.git 2.9.4-alt1: build start
2024-Jan-16 22:43:41 :: [x86_64] #100 sssd.git 2.9.4-alt1: build start
2024-Jan-16 22:43:41 :: [armh] #100 sssd.git 2.9.4-alt1: build start
2024-Jan-16 22:43:41 :: [aarch64] #100 sssd.git 2.9.4-alt1: build start
2024-Jan-16 22:43:41 :: [ppc64le] #100 sssd.git 2.9.4-alt1: build start
[x86_64] /usr/src/in/srpm/sssd-2.9.4-alt1.src.rpm: unprintable package information: ââ
[x86_64] sisyphus_check: check-printable ERROR: package information violation
[x86_64] hsh-rebuild: sssd-2.9.4-alt1.src.rpm: sisyphus_check failed.
2024-Jan-16 22:44:17 :: [x86_64] sssd.git 2.9.4-alt1: remote: build failed
2024-Jan-16 22:44:17 :: [x86_64] #100 sssd.git 2.9.4-alt1: build FAILED
2024-Jan-16 22:44:17 :: [x86_64] requesting cancellation of task processing
[i586] /usr/src/in/srpm/sssd-2.9.4-alt1.src.rpm: unprintable package information: ââ
[i586] sisyphus_check: check-printable ERROR: package information violation
[i586] hsh-rebuild: sssd-2.9.4-alt1.src.rpm: sisyphus_check failed.
2024-Jan-16 22:44:21 :: [i586] sssd.git 2.9.4-alt1: remote: build failed
2024-Jan-16 22:44:21 :: [i586] #100 sssd.git 2.9.4-alt1: build FAILED
[aarch64] /usr/src/in/srpm/sssd-2.9.4-alt1.src.rpm: unprintable package information: ââ
[aarch64] sisyphus_check: check-printable ERROR: package information violation
[aarch64] hsh-rebuild: sssd-2.9.4-alt1.src.rpm: sisyphus_check failed.
2024-Jan-16 22:44:50 :: [aarch64] sssd.git 2.9.4-alt1: remote: build failed
2024-Jan-16 22:44:50 :: [aarch64] #100 sssd.git 2.9.4-alt1: build FAILED
[ppc64le] /usr/src/in/srpm/sssd-2.9.4-alt1.src.rpm: unprintable package information: ââ
[ppc64le] sisyphus_check: check-printable ERROR: package information violation
[ppc64le] hsh-rebuild: sssd-2.9.4-alt1.src.rpm: sisyphus_check failed.
2024-Jan-16 22:44:58 :: [ppc64le] sssd.git 2.9.4-alt1: remote: build failed
2024-Jan-16 22:44:58 :: [ppc64le] #100 sssd.git 2.9.4-alt1: build FAILED
[armh] /usr/src/in/srpm/sssd-2.9.4-alt1.src.rpm: unprintable package information: ââ
[armh] sisyphus_check: check-printable ERROR: package information violation
[armh] hsh-rebuild: sssd-2.9.4-alt1.src.rpm: sisyphus_check failed.
2024-Jan-16 22:45:22 :: [armh] sssd.git 2.9.4-alt1: remote: build failed
2024-Jan-16 22:45:22 :: [armh] #100 sssd.git 2.9.4-alt1: build FAILED
2024-Jan-16 22:44:17 :: [x86_64] build FAILED
2024-Jan-16 22:44:21 :: [i586] build FAILED
2024-Jan-16 22:44:50 :: [aarch64] build FAILED
2024-Jan-16 22:44:58 :: [ppc64le] build FAILED
2024-Jan-16 22:45:23 :: [armh] build FAILED
2024-Jan-16 22:45:23 :: task #338343 for sisyphus FAILED
More information about the Sisyphus-incominger
mailing list