[#337137] [test-only] FAILED (try 5) cmake.git=3.28.1-alt1 telegram-desktop.git=4.14.4-alt1

Girar awaiter (lav) girar-builder at altlinux.org
Fri Jan 12 13:51:51 MSK 2024


https://git.altlinux.org/tasks/337137/logs/events.5.1.log

subtask  name              aarch64   armh    i586  ppc64le  x86_64
   #100  cmake                9:59  15:39    7:07     9:11    5:34
   #400  telegram-desktop        ?      ?  failed        ?  failed

2024-Jan-12 10:36:09 :: test-only task #337137 for sisyphus resumed by lav:
2024-Jan-12 10:36:09 :: message: test rebuild
#100 build 3.28.1-alt1 from /people/lav/packages/cmake.git fetched at 2023-Dec-24 23:43:35
#200 removed
#240 removed
#300 removed
#400 build 4.14.4-alt1 from /gears/t/telegram-desktop.git fetched at 2024-Jan-12 10:36:04 from sisyphus
2024-Jan-12 10:36:10 :: created build repo
2024-Jan-12 10:36:11 :: [armh] #100 cmake.git 3.28.1-alt1: build start
2024-Jan-12 10:36:11 :: [x86_64] #100 cmake.git 3.28.1-alt1: build start
2024-Jan-12 10:36:11 :: [i586] #100 cmake.git 3.28.1-alt1: build start
2024-Jan-12 10:36:11 :: [ppc64le] #100 cmake.git 3.28.1-alt1: build start
2024-Jan-12 10:36:11 :: [aarch64] #100 cmake.git 3.28.1-alt1: build start
2024-Jan-12 10:41:45 :: [x86_64] #100 cmake.git 3.28.1-alt1: build OK
2024-Jan-12 10:41:46 :: [x86_64] #400 telegram-desktop.git 4.14.4-alt1: build start
2024-Jan-12 10:43:18 :: [i586] #100 cmake.git 3.28.1-alt1: build OK
2024-Jan-12 10:43:18 :: [i586] #400 telegram-desktop.git 4.14.4-alt1: build start
[x86_64] [ 19%] Building CXX object Telegram/lib_storage/CMakeFiles/lib_storage.dir/storage/cache/storage_cache_database_object.cpp.o
[x86_64] cd /usr/src/RPM/BUILD/telegram-desktop-4.14.4/Telegram/lib_storage && /usr/bin/c++ -DCRL_FORCE_COMMON_QUEUE -DGI_INLINE -DGLIB_VERSION_MAX_ALLOWED=GLIB_VERSION_2_56 -DGLIB_VERSION_MIN_REQUIRED=GLIB_VERSION_2_56 -DKCOREADDONS_EXPORT="" -DQT_CORE_LIB -DQT_DBUS_LIB -DQT_DEPRECATED_WARNINGS_SINCE=0x051500 -DQT_GUI_LIB -DQT_IMPLICIT_QCHAR_CONSTRUCTION -DQT_NETWORK_LIB -DQT_NO_CAST_FROM_BYTEARRAY -DQT_NO_DEBUG -DQT_NO_KEYWORDS -DQT_OPENGLWIDGETS_LIB -DQT_OPENGL_LIB -DQT_QMLINTEGRATION_LIB -DQT_QMLMODELS_LIB -DQT_QML_LIB -DQT_QUICKWIDGETS_LIB -DQT_QUICK_LIB -DQT_SVG_LIB -DQT_WAYLANDCOMPOSITOR_LIB -DQT_WIDGETS_LIB -I/usr/src/RPM/BUILD/telegram-desktop-4.14.4/Telegram/lib_storage -I/usr/src/RPM/BUILD/telegram-desktop-4.14.4/Telegram/lib_base -I/usr/src/RPM/BUILD/telegram-desktop-4.14.4/Telegram/lib_rpl -I/usr/src/RPM/BUILD/telegram-desktop-4.14.4/Telegram/lib_crl -I/usr/src/RPM/BUILD/telegram-desktop-4.14.4/cmake/external/glib/cppgir -I/usr/src/RPM/BUILD/telegram-desktop-4.14.4/cmake/external/glib/cppgir/gi -I/usr/src/RPM/BUILD/telegram-desktop-4.14.4/cmake/external/glib/cppgir/override -I/usr/src/RPM/BUILD/telegram-desktop-4.14.4/cmake/external/glib/cppgir/expected-lite/include -isystem /usr/include/qt6/QtCore -isystem /usr/include/qt6 -isystem /usr/lib64/qt6/mkspecs/linux-g++ -isystem /usr/include/qt6/QtCore/6.6.1 -isystem /usr/include/qt6/QtCore/6.6.1/QtCore -isystem /usr/include/qt6/QtGui -isystem /usr/include/qt6/QtGui/6.6.1 -isystem /usr/include/qt6/QtGui/6.6.1/QtGui -isystem /usr/include/qt6/QtOpenGL -isystem /usr/include/qt6/QtWidgets -isystem /usr/include/qt6/QtWidgets/6.6.1 -isystem /usr/include/qt6/QtWidgets/6.6.1/QtWidgets -isystem /usr/include/qt6/QtOpenGLWidgets -isystem /usr/include/qt6/QtNetwork -isystem /usr/include/qt6/QtSvg -isystem /usr/include/qt6/QtDBus -isystem /usr/include/qt6/QtQuick -isystem /usr/include/qt6/QtQml -isystem /usr/include/qt6/QtQmlIntegration -isystem /usr/include/qt6/QtQmlModels -isystem /usr/include/qt6/QtQuickWidgets -isystem /usr/include/qt6/QtWaylandCompositor -isystem /usr/share -isystem /usr/include/giomm-2.68 -isystem /usr/lib64/giomm-2.68/include -isystem /usr/include/libmount -isystem /usr/include/blkid -isystem /usr/include/glibmm-2.68 -isystem /usr/lib64/glibmm-2.68/include -isystem /usr/include/glib-2.0 -isystem /usr/lib64/glib-2.0/include -isystem /usr/include/sigc++-3.0 -isystem /usr/lib64/sigc++-3.0/include -isystem /usr/src/RPM/BUILD/telegram-desktop-4.14.4/Telegram/ThirdParty/kcoreaddons/src/lib/io -isystem /usr/src/RPM/BUILD/telegram-desktop-4.14.4/Telegram/ThirdParty/kcoreaddons/src/lib/util -isystem /usr/src/RPM/BUILD/telegram-desktop-4.14.4/cmake/external/kcoreaddons/headers/public -isystem /usr/src/RPM/BUILD/telegram-desktop-4.14.4/Telegram/lib_base/gen -isystem /usr/src/RPM/BUILD/telegram-desktop-4.14.4/gen -isystem /usr/include/gio-unix-2.0 -pipe -frecord-gcc-switches -Wall -g -O2 -flto=auto -fpermissive -DNDEBUG -Wno-strict-aliasing -Wno-unused-variable -Wno-sign-compare -Wno-switch -fstack-protector-all -fstack-clash-protection -D_GLIBCXX_ASSERTIONS -fcf-protection -O2 -DNDEBUG -std=gnu++20 -fPIC -fno-strict-aliasing -pipe -Wall -Wextra -Wno-unused-parameter -Wno-switch -Wno-maybe-uninitialized -Wno-missing-field-initializers -Wno-sign-compare -Wno-deprecated -pthread -Winvalid-pch -include /usr/src/RPM/BUILD/telegram-desktop-4.14.4/Telegram/lib_storage/CMakeFiles/lib_storage.dir/cmake_pch.hxx -MD -MT Telegram/lib_storage/CMakeFiles/lib_storage.dir/storage/cache/storage_cache_database_object.cpp.o -MF CMakeFiles/lib_storage.dir/storage/cache/storage_cache_database_object.cpp.o.d -o CMakeFiles/lib_storage.dir/storage/cache/storage_cache_database_object.cpp.o -c /usr/src/RPM/BUILD/telegram-desktop-4.14.4/Telegram/lib_storage/storage/cache/storage_cache_database_object.cpp
[x86_64] make[2]: Leaving directory '/usr/src/RPM/BUILD/telegram-desktop-4.14.4'
[x86_64] make[1]: Entering directory '/usr/src/RPM/BUILD/telegram-desktop-4.14.4'
[x86_64] [ 19%] Built target lib_storage
[x86_64] make[1]: Leaving directory '/usr/src/RPM/BUILD/telegram-desktop-4.14.4'
[x86_64] make: *** [Makefile:136: all] Error 2
[x86_64] error: Bad exit status from /usr/src/tmp/rpm-tmp.38013 (%build)
[x86_64] RPM build errors:
[x86_64]     Macro %_Kservices not found
2024-Jan-12 10:43:40 :: [x86_64] telegram-desktop.git 4.14.4-alt1: remote: build failed
2024-Jan-12 10:43:40 :: [x86_64] #400 telegram-desktop.git 4.14.4-alt1: build FAILED
2024-Jan-12 10:43:40 :: [x86_64] requesting cancellation of task processing
[i586] [ 19%] Building CXX object Telegram/lib_storage/CMakeFiles/lib_storage.dir/storage/cache/storage_cache_database_object.cpp.o
[i586] cd /usr/src/RPM/BUILD/telegram-desktop-4.14.4/Telegram/lib_storage && /usr/bin/c++ -DCRL_FORCE_COMMON_QUEUE -DGI_INLINE -DGLIB_VERSION_MAX_ALLOWED=GLIB_VERSION_2_56 -DGLIB_VERSION_MIN_REQUIRED=GLIB_VERSION_2_56 -DKCOREADDONS_EXPORT="" -DQT_CORE_LIB -DQT_DBUS_LIB -DQT_DEPRECATED_WARNINGS_SINCE=0x051500 -DQT_GUI_LIB -DQT_IMPLICIT_QCHAR_CONSTRUCTION -DQT_NETWORK_LIB -DQT_NO_CAST_FROM_BYTEARRAY -DQT_NO_DEBUG -DQT_NO_KEYWORDS -DQT_OPENGLWIDGETS_LIB -DQT_OPENGL_LIB -DQT_QMLINTEGRATION_LIB -DQT_QMLMODELS_LIB -DQT_QML_LIB -DQT_QUICKWIDGETS_LIB -DQT_QUICK_LIB -DQT_SVG_LIB -DQT_WAYLANDCOMPOSITOR_LIB -DQT_WIDGETS_LIB -I/usr/src/RPM/BUILD/telegram-desktop-4.14.4/Telegram/lib_storage -I/usr/src/RPM/BUILD/telegram-desktop-4.14.4/Telegram/lib_base -I/usr/src/RPM/BUILD/telegram-desktop-4.14.4/Telegram/lib_rpl -I/usr/src/RPM/BUILD/telegram-desktop-4.14.4/Telegram/lib_crl -I/usr/src/RPM/BUILD/telegram-desktop-4.14.4/cmake/external/glib/cppgir -I/usr/src/RPM/BUILD/telegram-desktop-4.14.4/cmake/external/glib/cppgir/gi -I/usr/src/RPM/BUILD/telegram-desktop-4.14.4/cmake/external/glib/cppgir/override -I/usr/src/RPM/BUILD/telegram-desktop-4.14.4/cmake/external/glib/cppgir/expected-lite/include -isystem /usr/include/qt6/QtCore -isystem /usr/include/qt6 -isystem /usr/lib/qt6/mkspecs/linux-g++ -isystem /usr/include/qt6/QtCore/6.6.1 -isystem /usr/include/qt6/QtCore/6.6.1/QtCore -isystem /usr/include/qt6/QtGui -isystem /usr/include/qt6/QtGui/6.6.1 -isystem /usr/include/qt6/QtGui/6.6.1/QtGui -isystem /usr/include/qt6/QtOpenGL -isystem /usr/include/qt6/QtWidgets -isystem /usr/include/qt6/QtWidgets/6.6.1 -isystem /usr/include/qt6/QtWidgets/6.6.1/QtWidgets -isystem /usr/include/qt6/QtOpenGLWidgets -isystem /usr/include/qt6/QtNetwork -isystem /usr/include/qt6/QtSvg -isystem /usr/include/qt6/QtDBus -isystem /usr/include/qt6/QtQuick -isystem /usr/include/qt6/QtQml -isystem /usr/include/qt6/QtQmlIntegration -isystem /usr/include/qt6/QtQmlModels -isystem /usr/include/qt6/QtQuickWidgets -isystem /usr/include/qt6/QtWaylandCompositor -isystem /usr/share -isystem /usr/include/giomm-2.68 -isystem /usr/lib/giomm-2.68/include -isystem /usr/include/libmount -isystem /usr/include/blkid -isystem /usr/include/glibmm-2.68 -isystem /usr/lib/glibmm-2.68/include -isystem /usr/include/glib-2.0 -isystem /usr/lib/glib-2.0/include -isystem /usr/include/sigc++-3.0 -isystem /usr/lib/sigc++-3.0/include -isystem /usr/src/RPM/BUILD/telegram-desktop-4.14.4/Telegram/ThirdParty/kcoreaddons/src/lib/io -isystem /usr/src/RPM/BUILD/telegram-desktop-4.14.4/Telegram/ThirdParty/kcoreaddons/src/lib/util -isystem /usr/src/RPM/BUILD/telegram-desktop-4.14.4/cmake/external/kcoreaddons/headers/public -isystem /usr/src/RPM/BUILD/telegram-desktop-4.14.4/Telegram/lib_base/gen -isystem /usr/src/RPM/BUILD/telegram-desktop-4.14.4/gen -isystem /usr/include/gio-unix-2.0 -pipe -frecord-gcc-switches -Wall -g0 -O2  -march=i586 -mtune=generic -fpermissive -DNDEBUG -Wno-strict-aliasing -Wno-unused-variable -Wno-sign-compare -Wno-switch -fstack-protector-all -fstack-clash-protection -D_GLIBCXX_ASSERTIONS -O2 -DNDEBUG -std=gnu++20 -fPIC -fno-strict-aliasing -pipe -Wall -Wextra -Wno-unused-parameter -Wno-switch -Wno-maybe-uninitialized -Wno-missing-field-initializers -Wno-sign-compare -Wno-deprecated -pthread -Winvalid-pch -include /usr/src/RPM/BUILD/telegram-desktop-4.14.4/Telegram/lib_storage/CMakeFiles/lib_storage.dir/cmake_pch.hxx -MD -MT Telegram/lib_storage/CMakeFiles/lib_storage.dir/storage/cache/storage_cache_database_object.cpp.o -MF CMakeFiles/lib_storage.dir/storage/cache/storage_cache_database_object.cpp.o.d -o CMakeFiles/lib_storage.dir/storage/cache/storage_cache_database_object.cpp.o -c /usr/src/RPM/BUILD/telegram-desktop-4.14.4/Telegram/lib_storage/storage/cache/storage_cache_database_object.cpp
[i586] make[2]: Leaving directory '/usr/src/RPM/BUILD/telegram-desktop-4.14.4'
[i586] make[1]: Entering directory '/usr/src/RPM/BUILD/telegram-desktop-4.14.4'
[i586] [ 19%] Built target lib_storage
[i586] make[1]: Leaving directory '/usr/src/RPM/BUILD/telegram-desktop-4.14.4'
[i586] make: *** [Makefile:136: all] Error 2
[i586] error: Bad exit status from /usr/src/tmp/rpm-tmp.41366 (%build)
[i586] RPM build errors:
[i586]     Macro %_Kservices not found
2024-Jan-12 10:45:15 :: [i586] telegram-desktop.git 4.14.4-alt1: remote: build failed
2024-Jan-12 10:45:15 :: [i586] #400 telegram-desktop.git 4.14.4-alt1: build FAILED
2024-Jan-12 10:45:22 :: [ppc64le] #100 cmake.git 3.28.1-alt1: build OK
2024-Jan-12 10:45:22 :: [ppc64le] task processing CANCELLED
2024-Jan-12 10:46:10 :: [aarch64] #100 cmake.git 3.28.1-alt1: build OK
2024-Jan-12 10:46:11 :: [aarch64] task processing CANCELLED
2024-Jan-12 10:51:50 :: [armh] #100 cmake.git 3.28.1-alt1: build OK
2024-Jan-12 10:51:50 :: [armh] task processing CANCELLED
2024-Jan-12 10:43:40 :: [x86_64] build FAILED
2024-Jan-12 10:45:15 :: [i586] build FAILED
2024-Jan-12 10:45:22 :: [ppc64le] build FAILED
2024-Jan-12 10:46:11 :: [aarch64] build FAILED
2024-Jan-12 10:51:50 :: [armh] build FAILED
2024-Jan-12 10:51:50 :: task #337137 for sisyphus FAILED


More information about the Sisyphus-incominger mailing list