[#356002] FAILED picat.git=3.6.8-alt1
Girar awaiter (vkni)
girar-builder at altlinux.org
Sat Aug 24 23:19:58 MSK 2024
https://git.altlinux.org/tasks/356002/logs/events.1.1.log
subtask name aarch64 i586 ppc64le x86_64
#100 picat failed failed failed failed
2024-Aug-24 20:18:38 :: task #356002 for sisyphus started by vkni:
#100 build 3.6.8-alt1 from /people/vkni/packages/picat.git fetched at 2024-Aug-24 20:18:36
2024-Aug-24 20:18:39 :: [x86_64] #100 picat.git 3.6.8-alt1: build start
2024-Aug-24 20:18:39 :: [ppc64le] #100 picat.git 3.6.8-alt1: build start
2024-Aug-24 20:18:39 :: [aarch64] #100 picat.git 3.6.8-alt1: build start
2024-Aug-24 20:18:39 :: [i586] #100 picat.git 3.6.8-alt1: build start
[x86_64] g++ -DGC -DGCC -DPICAT -DSAT -DM64BITS -DFANN_NO_DLL -DFANN -c -O3 -fno-strict-aliasing -finline-functions -fomit-frame-pointer -Dunix -DLINUX -DPOSIX -Wno-error=unused-label -DDEFAULT_PICATPATH=\"/usr/lib64/picat\" -Ifann/src/include fann/fann_interface.cpp
[x86_64] make: g++: No such file or directory
[x86_64] make: *** [common.mak:407: fann_interface.o] Error 127
2024-Aug-24 20:19:15 :: [x86_64] picat.git 3.6.8-alt1: remote: build failed
2024-Aug-24 20:19:15 :: [x86_64] #100 picat.git 3.6.8-alt1: build FAILED
2024-Aug-24 20:19:15 :: [x86_64] requesting cancellation of task processing
[i586] 92 | #define ADDTAG3(op, tag) ((BPLONG)(op) | tag)
[i586] bapi.h:97:33: note: in definition of macro 'PUSHTRAILC'
[i586] 97 | *trail_top-- = (BPLONG)(addr);}
[i586] bapi.h:77:20: note: in expansion of macro 'ADDTAG3'
[i586] 77 | PUSHTRAILC(ADDTAG3(p, TRAIL_VAL_NONATOMIC), cont);}
[i586] event.h:42:9: note: in expansion of macro 'PUSHTRAIL_H_NONATOMIC'
[i586] 42 | PUSHTRAIL_H_NONATOMIC(dv_ptr, DV_var(dv_ptr)); \
[i586] clpfd_libs.c:1279:21: note: in expansion of macro 'ASSIGN_DVAR'
[i586] 1279 | ASSIGN_DVAR(dv_ptr, MAKEINT(first1));
[i586] make: Leaving directory '/usr/src/RPM/BUILD/picat-3.6.8/emu'
2024-Aug-24 20:19:21 :: [i586] picat.git 3.6.8-alt1: remote: build failed
2024-Aug-24 20:19:21 :: [i586] #100 picat.git 3.6.8-alt1: build FAILED
[aarch64] g++ -DGC -DGCC -DPICAT -DSAT -DM64BITS -DFANN_NO_DLL -DFANN -c -O3 -fno-strict-aliasing -finline-functions -fomit-frame-pointer -Dunix -DLINUX -DPOSIX -Wno-error=unused-label -DDEFAULT_PICATPATH=\"/usr/lib64/picat\" -Ifann/src/include fann/fann_interface.cpp
[aarch64] make: g++: No such file or directory
[aarch64] make: *** [common.mak:407: fann_interface.o] Error 127
2024-Aug-24 20:19:56 :: [aarch64] picat.git 3.6.8-alt1: remote: build failed
2024-Aug-24 20:19:56 :: [aarch64] #100 picat.git 3.6.8-alt1: build FAILED
[ppc64le] g++ -DGC -DGCC -DPICAT -DSAT -DM64BITS -DFANN_NO_DLL -DFANN -c -O3 -fno-strict-aliasing -finline-functions -fomit-frame-pointer -Dunix -DLINUX -DPOSIX -Wno-error=unused-label -DDEFAULT_PICATPATH=\"/usr/lib64/picat\" -Ifann/src/include fann/fann_interface.cpp
[ppc64le] make: g++: No such file or directory
[ppc64le] make: *** [common.mak:407: fann_interface.o] Error 127
2024-Aug-24 20:19:58 :: [ppc64le] picat.git 3.6.8-alt1: remote: build failed
2024-Aug-24 20:19:58 :: [ppc64le] #100 picat.git 3.6.8-alt1: build FAILED
2024-Aug-24 20:19:15 :: [x86_64] build FAILED
2024-Aug-24 20:19:22 :: [i586] build FAILED
2024-Aug-24 20:19:56 :: [aarch64] build FAILED
2024-Aug-24 20:19:58 :: [ppc64le] build FAILED
2024-Aug-24 20:19:58 :: task #356002 for sisyphus FAILED
More information about the Sisyphus-incominger
mailing list