[#344230] [test-only] FAILED (try 3) rust.git=1.77.1-alt1 nss.git=3.99-alt1 firefox.git=124.0.2-alt1 ...
Girar awaiter (rauty)
girar-builder at altlinux.org
Thu Apr 4 20:53:08 MSK 2024
https://git.altlinux.org/tasks/344230/logs/events.3.1.log
subtask name aarch64 i586 ppc64le x86_64
#100 rust 1:02:03 35:42 1:00:02 28:36
#140 nss ? 51:23 ? 31:08
2024-Apr-04 16:26:00 :: test-only task #344230 for sisyphus resumed by rauty:
#100 build 1.77.1-alt1 from /people/rauty/packages/rust.git fetched at 2024-Apr-02 15:43:51
#140 build 3.99-alt1 from /people/rauty/packages/nss.git fetched at 2024-Apr-04 16:25:05
#200 removed
#300 build 124.0.2-alt1 from /people/rauty/packages/firefox.git fetched at 2024-Apr-04 12:30:37
#400 build 124.0.2-alt1 from /people/rauty/packages/firefox-unmet-holder.git fetched at 2024-Apr-04 12:32:15
2024-Apr-04 16:26:01 :: created build repo
2024-Apr-04 16:26:02 :: [aarch64] #100 rust.git 1.77.1-alt1: build start
2024-Apr-04 16:26:02 :: [i586] #100 rust.git 1.77.1-alt1: build start
2024-Apr-04 16:26:02 :: [ppc64le] #100 rust.git 1.77.1-alt1: build start
2024-Apr-04 16:26:02 :: [x86_64] #100 rust.git 1.77.1-alt1: build start
2024-Apr-04 16:54:38 :: [x86_64] #100 rust.git 1.77.1-alt1: build OK
2024-Apr-04 16:54:39 :: [x86_64] #140 nss.git 3.99-alt1: build start
2024-Apr-04 17:01:44 :: [i586] #100 rust.git 1.77.1-alt1: build OK
2024-Apr-04 17:01:44 :: [i586] #140 nss.git 3.99-alt1: build start
2024-Apr-04 17:08:18 :: task abort requested by rauty.
2024-Apr-04 17:25:47 :: [x86_64] #140 nss.git 3.99-alt1: build OK
2024-Apr-04 17:25:47 :: [x86_64] task processing CANCELLED
2024-Apr-04 17:26:04 :: [ppc64le] #100 rust.git 1.77.1-alt1: build OK
2024-Apr-04 17:26:05 :: [ppc64le] task processing CANCELLED
2024-Apr-04 17:28:05 :: [aarch64] #100 rust.git 1.77.1-alt1: build OK
2024-Apr-04 17:28:05 :: [aarch64] task processing CANCELLED
2024-Apr-04 17:53:07 :: [i586] #140 nss.git 3.99-alt1: build OK
2024-Apr-04 17:53:07 :: [i586] task processing CANCELLED
2024-Apr-04 17:25:47 :: [x86_64] build FAILED
2024-Apr-04 17:26:05 :: [ppc64le] build FAILED
2024-Apr-04 17:28:05 :: [aarch64] build FAILED
2024-Apr-04 17:53:08 :: [i586] build FAILED
2024-Apr-04 17:53:08 :: task #344230 for sisyphus FAILED
More information about the Sisyphus-incominger
mailing list