[#344312] [test-only] FAILED checkrpms.git=1.0.0-alt1
Girar awaiter (nit)
girar-builder at altlinux.org
Wed Apr 3 21:45:11 MSK 2024
https://git.altlinux.org/tasks/344312/logs/events.1.1.log
subtask name aarch64 i586 ppc64le x86_64
#100 checkrpms failed failed failed failed
2024-Apr-03 18:44:37 :: test-only task #344312 for sisyphus started by nit:
#100 build 1.0.0-alt1 from /people/nit/packages/checkrpms.git fetched at 2024-Apr-03 18:44:29
2024-Apr-03 18:44:39 :: [i586] #100 checkrpms.git 1.0.0-alt1: build start
2024-Apr-03 18:44:39 :: [ppc64le] #100 checkrpms.git 1.0.0-alt1: build start
2024-Apr-03 18:44:39 :: [aarch64] #100 checkrpms.git 1.0.0-alt1: build start
2024-Apr-03 18:44:39 :: [x86_64] #100 checkrpms.git 1.0.0-alt1: build start
[i586] File "<string>", line 3, in <module>
[i586] ModuleNotFoundError: No module named 'find_packages'
[i586] Traceback (most recent call last):
[i586] --
[i586] raise RuntimeError(err_msg) from None
[i586] RuntimeError: build_wheel failed
2024-Apr-03 18:44:57 :: [i586] checkrpms.git 1.0.0-alt1: remote: build failed
2024-Apr-03 18:44:57 :: [i586] #100 checkrpms.git 1.0.0-alt1: build FAILED
2024-Apr-03 18:44:57 :: [i586] requesting cancellation of task processing
[x86_64] File "<string>", line 3, in <module>
[x86_64] ModuleNotFoundError: No module named 'find_packages'
[x86_64] Traceback (most recent call last):
[x86_64] --
[x86_64] raise RuntimeError(err_msg) from None
[x86_64] RuntimeError: build_wheel failed
2024-Apr-03 18:44:58 :: [x86_64] checkrpms.git 1.0.0-alt1: remote: build failed
2024-Apr-03 18:44:58 :: [x86_64] #100 checkrpms.git 1.0.0-alt1: build FAILED
[aarch64] File "<string>", line 3, in <module>
[aarch64] ModuleNotFoundError: No module named 'find_packages'
[aarch64] Traceback (most recent call last):
[aarch64] --
[aarch64] raise RuntimeError(err_msg) from None
[aarch64] RuntimeError: build_wheel failed
2024-Apr-03 18:45:08 :: [aarch64] checkrpms.git 1.0.0-alt1: remote: build failed
2024-Apr-03 18:45:08 :: [aarch64] #100 checkrpms.git 1.0.0-alt1: build FAILED
[ppc64le] File "<string>", line 3, in <module>
[ppc64le] ModuleNotFoundError: No module named 'find_packages'
[ppc64le] Traceback (most recent call last):
[ppc64le] --
[ppc64le] raise RuntimeError(err_msg) from None
[ppc64le] RuntimeError: build_wheel failed
2024-Apr-03 18:45:11 :: [ppc64le] checkrpms.git 1.0.0-alt1: remote: build failed
2024-Apr-03 18:45:11 :: [ppc64le] #100 checkrpms.git 1.0.0-alt1: build FAILED
2024-Apr-03 18:44:58 :: [i586] build FAILED
2024-Apr-03 18:44:58 :: [x86_64] build FAILED
2024-Apr-03 18:45:08 :: [aarch64] build FAILED
2024-Apr-03 18:45:11 :: [ppc64le] build FAILED
2024-Apr-03 18:45:11 :: task #344312 for sisyphus FAILED
More information about the Sisyphus-incominger
mailing list