[#329989] [test-only] FAILED gem-puppet.git=8.2.0-alt1
Girar awaiter (cas)
girar-builder at altlinux.org
Thu Sep 21 06:15:19 MSK 2023
https://git.altlinux.org/tasks/329989/logs/events.1.1.log
subtask name aarch64 armh i586 ppc64le x86_64
#100 gem-puppet failed failed failed failed failed
2023-Sep-21 03:14:17 :: test-only task #329989 for sisyphus started by cas:
#100 build 8.2.0-alt1 from /people/cas/packages/gem-puppet.git fetched at 2023-Sep-21 03:14:16
2023-Sep-21 03:14:19 :: [i586] #100 gem-puppet.git 8.2.0-alt1: build start
2023-Sep-21 03:14:19 :: [aarch64] #100 gem-puppet.git 8.2.0-alt1: build start
2023-Sep-21 03:14:19 :: [ppc64le] #100 gem-puppet.git 8.2.0-alt1: build start
2023-Sep-21 03:14:19 :: [armh] #100 gem-puppet.git 8.2.0-alt1: build start
2023-Sep-21 03:14:19 :: [x86_64] #100 gem-puppet.git 8.2.0-alt1: build start
[x86_64] patching file lib/puppet/thread_local.rb
[x86_64] Hunk #1 FAILED at 3.
[x86_64] 1 out of 1 hunk FAILED -- saving rejects to file lib/puppet/thread_local.rb.rej
2023-Sep-21 03:14:43 :: [x86_64] gem-puppet.git 8.2.0-alt1: remote: build failed
2023-Sep-21 03:14:43 :: [x86_64] #100 gem-puppet.git 8.2.0-alt1: build FAILED
2023-Sep-21 03:14:44 :: [x86_64] requesting cancellation of task processing
[i586] patching file lib/puppet/thread_local.rb
[i586] Hunk #1 FAILED at 3.
[i586] 1 out of 1 hunk FAILED -- saving rejects to file lib/puppet/thread_local.rb.rej
2023-Sep-21 03:14:47 :: [i586] gem-puppet.git 8.2.0-alt1: remote: build failed
2023-Sep-21 03:14:47 :: [i586] #100 gem-puppet.git 8.2.0-alt1: build FAILED
[aarch64] patching file lib/puppet/thread_local.rb
[aarch64] Hunk #1 FAILED at 3.
[aarch64] 1 out of 1 hunk FAILED -- saving rejects to file lib/puppet/thread_local.rb.rej
2023-Sep-21 03:15:00 :: [aarch64] gem-puppet.git 8.2.0-alt1: remote: build failed
2023-Sep-21 03:15:00 :: [aarch64] #100 gem-puppet.git 8.2.0-alt1: build FAILED
[ppc64le] patching file lib/puppet/thread_local.rb
[ppc64le] Hunk #1 FAILED at 3.
[ppc64le] 1 out of 1 hunk FAILED -- saving rejects to file lib/puppet/thread_local.rb.rej
2023-Sep-21 03:15:04 :: [ppc64le] gem-puppet.git 8.2.0-alt1: remote: build failed
2023-Sep-21 03:15:04 :: [ppc64le] #100 gem-puppet.git 8.2.0-alt1: build FAILED
[armh] patching file lib/puppet/thread_local.rb
[armh] Hunk #1 FAILED at 3.
[armh] 1 out of 1 hunk FAILED -- saving rejects to file lib/puppet/thread_local.rb.rej
2023-Sep-21 03:15:19 :: [armh] gem-puppet.git 8.2.0-alt1: remote: build failed
2023-Sep-21 03:15:19 :: [armh] #100 gem-puppet.git 8.2.0-alt1: build FAILED
2023-Sep-21 03:14:44 :: [x86_64] build FAILED
2023-Sep-21 03:14:47 :: [i586] build FAILED
2023-Sep-21 03:15:00 :: [aarch64] build FAILED
2023-Sep-21 03:15:04 :: [ppc64le] build FAILED
2023-Sep-21 03:15:19 :: [armh] build FAILED
2023-Sep-21 03:15:19 :: task #329989 for sisyphus FAILED
More information about the Sisyphus-incominger
mailing list