[#334339] [test-only] FAILED (try 8) rvm.git=1.29.12-alt1 ruby.git=3.1.4-alt1 rpm-build-ruby.git=1.1.1-alt1 ...

Girar awaiter (majioa) girar-builder at altlinux.org
Thu Nov 30 05:51:51 MSK 2023


https://git.altlinux.org/tasks/334339/logs/events.8.1.log

subtask  name            aarch64   armh  i586  ppc64le  x86_64
    #20  rvm                1:01   1:27    37     1:14      34
    #22  ruby              17:38  27:24  6:27    22:42    5:23
    #76  rpm-build-ruby        ?      ?     ?        ?      13
   #104  gem-setup             ?      ?     ?        ?  failed

2023-Nov-30 02:22:57 :: test-only task #334339 for sisyphus resumed by majioa:
2023-Nov-30 02:22:57 :: message: test
#20 build 1.29.12-alt1 from /people/majioa/packages/rvm.git fetched at 2023-Nov-28 18:21:15
#22 build 3.1.4-alt1 from /people/majioa/packages/ruby.git fetched at 2023-Nov-30 02:21:01
#24 removed
#30 removed
#40 removed
#60 removed
#70 removed
#74 removed
#76 build 1.1.1-alt1 from /people/majioa/packages/rpm-build-ruby.git fetched at 2023-Nov-28 23:15:05
#100 removed
#104 build 5.999.6-alt9 from /people/majioa/packages/gem-setup.git fetched at 2023-Nov-30 02:22:37
#110 removed
#120 removed
#140 build 0.9.17.13-alt0.1 from /people/majioa/packages/gem-amazon-ec2.git fetched at 2023-Nov-28 19:56:31
#200 removed
#220 removed
#240 removed
#300 removed
#400 build 1.0.2-alt1 from /people/majioa/packages/gem-bundler-unload.git fetched at 2023-Nov-22 00:28:21
#500 build 1.4.5-alt1 from /people/majioa/packages/gem-rubygems-bundler.git fetched at 2023-Nov-22 00:28:31
#600 build 3.2.0-alt1 from /people/majioa/packages/gem-session.git fetched at 2023-Nov-22 00:33:24
#700 build 0.4.5-alt1 from /people/majioa/packages/gem-tf.git fetched at 2023-Nov-22 00:36:59
#740 build 1.4.0-alt1 from /people/majioa/packages/gem-gem-wrappers.git fetched at 2023-Nov-27 13:27:31
#1000 removed
#1040 build 1.6.1-alt1 from /people/majioa/packages/gem-executable-hooks.git fetched at 2023-Nov-27 13:30:57
#1100 removed
#1140 removed
#1200 removed
#1300 removed
#1400 build 1.11.3.9-alt1 from /gears/g/gem-rvm.git fetched at 2023-Nov-27 17:40:50 from sisyphus
#1500 build 0.3.0-alt1 from /people/majioa/packages/gem-rubygems-server.git fetched at 2023-Nov-27 21:38:20
#1600 removed
#1700 build 1.7.3-alt1 from /people/majioa/packages/gem-racc.git fetched at 2023-Nov-28 23:04:14
#2000 build 2.8.5-alt1 from /people/majioa/packages/gem-mini-portile2.git fetched at 2023-Nov-28 23:42:53
#2100 build 1.0.0.4-alt0.1 from /people/majioa/packages/gem-benchmark-suite.git fetched at 2023-Nov-28 23:48:14
#2200 delete gem-chef-sugar
#2300 build 1.15.5-alt1 from /people/majioa/packages/gem-nokogiri.git fetched at 2023-Nov-28 23:54:53
#2400 build 4.1.0-alt1 from /people/majioa/packages/gem-childprocess.git fetched at 2023-Nov-28 23:59:55
#2500 build 0.105.0-alt1 from /people/majioa/packages/gem-excon.git fetched at 2023-Nov-29 00:04:54
#2600 build 0.87.2-alt1 from /people/majioa/packages/gem-foreman.git fetched at 2023-Nov-29 00:12:45
#2700 build 1.1.0-alt1 from /people/majioa/packages/gem-formatador.git fetched at 2023-Nov-29 00:13:10
#3000 build 0.2.3-alt3.1 from /people/majioa/packages/gem-gem-plugin.git fetched at 2023-Nov-29 00:18:30
#3100 build 2.6.0.2-alt0.1 from /people/majioa/packages/gem-less.git fetched at 2023-Nov-29 00:28:06
#3200 build 1.1.4-alt1 from /people/majioa/packages/gem-os.git fetched at 2023-Nov-29 00:36:21
#3300 build 1.0.1-alt1.3 from /people/majioa/packages/gem-yard-sitemap.git fetched at 2023-Nov-29 00:50:52
#3400 build 1.2.10-alt1 from /people/majioa/packages/gem-websocket.git fetched at 2023-Nov-29 00:51:33
#3500 delete gem-truthy
#3600 build 2.5.0-alt1 from /people/majioa/packages/gem-ruby2ruby.git fetched at 2023-Nov-29 01:10:42
#3700 build 0.0.16-alt1 from /people/majioa/packages/gem-linked-list.git fetched at 2023-Nov-29 01:17:13
#4000 build 1.13.0-alt1 from /people/majioa/packages/gem-progressbar.git fetched at 2023-Nov-29 02:32:53
#4100 build 0.7.10-alt1.1 from /people/majioa/packages/gem-alexandria-book-collection-manager.git fetched at 2023-Nov-29 12:28:22
#4200 build 13.1.0-alt1 from /people/majioa/packages/gem-rake.git fetched at 2023-Nov-30 00:40:34
2023-Nov-30 02:22:58 :: created build repo
2023-Nov-30 02:22:59 :: [x86_64] #20 rvm.git 1.29.12-alt1: build start
2023-Nov-30 02:22:59 :: [aarch64] #20 rvm.git 1.29.12-alt1: build start
2023-Nov-30 02:22:59 :: [i586] #20 rvm.git 1.29.12-alt1: build start
2023-Nov-30 02:22:59 :: [ppc64le] #20 rvm.git 1.29.12-alt1: build start
2023-Nov-30 02:22:59 :: [armh] #20 rvm.git 1.29.12-alt1: build start
2023-Nov-30 02:23:33 :: [x86_64] #20 rvm.git 1.29.12-alt1: build OK
2023-Nov-30 02:23:34 :: [x86_64] #22 ruby.git 3.1.4-alt1: build start
2023-Nov-30 02:23:36 :: [i586] #20 rvm.git 1.29.12-alt1: build OK
2023-Nov-30 02:23:36 :: [i586] #22 ruby.git 3.1.4-alt1: build start
2023-Nov-30 02:24:00 :: [aarch64] #20 rvm.git 1.29.12-alt1: build OK
2023-Nov-30 02:24:00 :: [aarch64] #22 ruby.git 3.1.4-alt1: build start
2023-Nov-30 02:24:13 :: [ppc64le] #20 rvm.git 1.29.12-alt1: build OK
2023-Nov-30 02:24:13 :: [ppc64le] #22 ruby.git 3.1.4-alt1: build start
2023-Nov-30 02:24:26 :: [armh] #20 rvm.git 1.29.12-alt1: build OK
2023-Nov-30 02:24:26 :: [armh] #22 ruby.git 3.1.4-alt1: build start
2023-Nov-30 02:28:57 :: [x86_64] #22 ruby.git 3.1.4-alt1: build OK
2023-Nov-30 02:28:58 :: [x86_64] #76 rpm-build-ruby.git 1.1.1-alt1: build start
2023-Nov-30 02:29:11 :: [x86_64] #76 rpm-build-ruby.git 1.1.1-alt1: build OK
2023-Nov-30 02:29:11 :: [x86_64] #104 gem-setup.git 5.999.6-alt9: build start
[x86_64] /usr/bin/which: no setup in (/usr/lib/rvm/bin:/usr/src/bin:/bin:/usr/bin:/usr/X11R6/bin:/usr/games:/var/cache/ruby/gemie/bin:/usr/lib/ruby/bin:/usr/bin:/bin)
[x86_64] ruby: No such file or directory -- provides (LoadError)
[x86_64] find-provides: ERROR: /usr/lib/rpm/ruby.prov failed
[x86_64] error: /bin/sh failed
[x86_64] error: Failed to find Provides
[x86_64] RPM build errors:
2023-Nov-30 02:29:35 :: [x86_64] gem-setup.git 5.999.6-alt9: remote: build failed
2023-Nov-30 02:29:35 :: [x86_64] #104 gem-setup.git 5.999.6-alt9: build FAILED
2023-Nov-30 02:29:35 :: [x86_64] requesting cancellation of task processing
2023-Nov-30 02:30:03 :: [i586] #22 ruby.git 3.1.4-alt1: build OK
2023-Nov-30 02:30:03 :: [i586] task processing CANCELLED
2023-Nov-30 02:41:38 :: [aarch64] #22 ruby.git 3.1.4-alt1: build OK
2023-Nov-30 02:41:38 :: [aarch64] task processing CANCELLED
2023-Nov-30 02:46:55 :: [ppc64le] #22 ruby.git 3.1.4-alt1: build OK
2023-Nov-30 02:46:55 :: [ppc64le] task processing CANCELLED
2023-Nov-30 02:51:50 :: [armh] #22 ruby.git 3.1.4-alt1: build OK
2023-Nov-30 02:51:50 :: [armh] task processing CANCELLED
2023-Nov-30 02:29:35 :: [x86_64] build FAILED
2023-Nov-30 02:30:03 :: [i586] build FAILED
2023-Nov-30 02:41:38 :: [aarch64] build FAILED
2023-Nov-30 02:46:55 :: [ppc64le] build FAILED
2023-Nov-30 02:51:50 :: [armh] build FAILED
2023-Nov-30 02:51:51 :: task #334339 for sisyphus FAILED


More information about the Sisyphus-incominger mailing list