[#333938] [test-only] FAILED (try 2) lager.git=0.1.1-alt1
Girar awaiter (zerg)
girar-builder at altlinux.org
Thu Nov 9 01:35:45 MSK 2023
https://git.altlinux.org/tasks/333938/logs/events.2.1.log
subtask name aarch64 armh i586 ppc64le x86_64
#100 lager failed failed failed failed failed
2023-Nov-08 22:34:56 :: test-only task #333938 for sisyphus resumed by zerg:
#100 build 0.1.1-alt1 from /people/zerg/packages/lager.git fetched at 2023-Nov-08 13:23:02
2023-Nov-08 22:34:57 :: #100: force rebuild
2023-Nov-08 22:34:58 :: [x86_64] #100 lager.git 0.1.1-alt1: build start
2023-Nov-08 22:34:58 :: [aarch64] #100 lager.git 0.1.1-alt1: build start
2023-Nov-08 22:34:58 :: [armh] #100 lager.git 0.1.1-alt1: build start
2023-Nov-08 22:34:58 :: [i586] #100 lager.git 0.1.1-alt1: build start
2023-Nov-08 22:34:58 :: [ppc64le] #100 lager.git 0.1.1-alt1: build start
[x86_64] asked CMake to find a package configuration file provided by "Zug", but
[x86_64] CMake did not find one.
[x86_64] Could not find a package configuration file provided by "Zug" with any of
[x86_64] the following names:
[x86_64] ZugConfig.cmake
[x86_64] zug-config.cmake
[x86_64] Add the installation prefix of "Zug" to CMAKE_PREFIX_PATH or set "Zug_DIR"
[x86_64] to a directory containing one of the above files. If "Zug" provides a
[x86_64] separate development package or SDK, be sure it has been installed.
[x86_64] -- Configuring incomplete, errors occurred!
2023-Nov-08 22:35:14 :: [x86_64] lager.git 0.1.1-alt1: remote: build failed
2023-Nov-08 22:35:14 :: [x86_64] #100 lager.git 0.1.1-alt1: build FAILED
2023-Nov-08 22:35:14 :: [x86_64] requesting cancellation of task processing
[i586] asked CMake to find a package configuration file provided by "Zug", but
[i586] CMake did not find one.
[i586] Could not find a package configuration file provided by "Zug" with any of
[i586] the following names:
[i586] ZugConfig.cmake
[i586] zug-config.cmake
[i586] Add the installation prefix of "Zug" to CMAKE_PREFIX_PATH or set "Zug_DIR"
[i586] to a directory containing one of the above files. If "Zug" provides a
[i586] separate development package or SDK, be sure it has been installed.
[i586] -- Configuring incomplete, errors occurred!
2023-Nov-08 22:35:14 :: [i586] lager.git 0.1.1-alt1: remote: build failed
2023-Nov-08 22:35:14 :: [i586] #100 lager.git 0.1.1-alt1: build FAILED
[aarch64] asked CMake to find a package configuration file provided by "Zug", but
[aarch64] CMake did not find one.
[aarch64] Could not find a package configuration file provided by "Zug" with any of
[aarch64] the following names:
[aarch64] ZugConfig.cmake
[aarch64] zug-config.cmake
[aarch64] Add the installation prefix of "Zug" to CMAKE_PREFIX_PATH or set "Zug_DIR"
[aarch64] to a directory containing one of the above files. If "Zug" provides a
[aarch64] separate development package or SDK, be sure it has been installed.
[aarch64] -- Configuring incomplete, errors occurred!
2023-Nov-08 22:35:28 :: [aarch64] lager.git 0.1.1-alt1: remote: build failed
2023-Nov-08 22:35:28 :: [aarch64] #100 lager.git 0.1.1-alt1: build FAILED
[ppc64le] asked CMake to find a package configuration file provided by "Zug", but
[ppc64le] CMake did not find one.
[ppc64le] Could not find a package configuration file provided by "Zug" with any of
[ppc64le] the following names:
[ppc64le] ZugConfig.cmake
[ppc64le] zug-config.cmake
[ppc64le] Add the installation prefix of "Zug" to CMAKE_PREFIX_PATH or set "Zug_DIR"
[ppc64le] to a directory containing one of the above files. If "Zug" provides a
[ppc64le] separate development package or SDK, be sure it has been installed.
[ppc64le] -- Configuring incomplete, errors occurred!
2023-Nov-08 22:35:32 :: [ppc64le] lager.git 0.1.1-alt1: remote: build failed
2023-Nov-08 22:35:32 :: [ppc64le] #100 lager.git 0.1.1-alt1: build FAILED
[armh] asked CMake to find a package configuration file provided by "Zug", but
[armh] CMake did not find one.
[armh] Could not find a package configuration file provided by "Zug" with any of
[armh] the following names:
[armh] ZugConfig.cmake
[armh] zug-config.cmake
[armh] Add the installation prefix of "Zug" to CMAKE_PREFIX_PATH or set "Zug_DIR"
[armh] to a directory containing one of the above files. If "Zug" provides a
[armh] separate development package or SDK, be sure it has been installed.
[armh] -- Configuring incomplete, errors occurred!
2023-Nov-08 22:35:45 :: [armh] lager.git 0.1.1-alt1: remote: build failed
2023-Nov-08 22:35:45 :: [armh] #100 lager.git 0.1.1-alt1: build FAILED
2023-Nov-08 22:35:14 :: [x86_64] build FAILED
2023-Nov-08 22:35:14 :: [i586] build FAILED
2023-Nov-08 22:35:28 :: [aarch64] build FAILED
2023-Nov-08 22:35:32 :: [ppc64le] build FAILED
2023-Nov-08 22:35:45 :: [armh] build FAILED
2023-Nov-08 22:35:45 :: task #333938 for sisyphus FAILED
More information about the Sisyphus-incominger
mailing list