[#317383] [test-only] FAILED (try 3) deepin-log-viewer.git=6.0.6-alt1

Girar awaiter (lvol) girar-builder at altlinux.org
Fri Mar 24 15:00:36 MSK 2023


https://git.altlinux.org/tasks/317383/logs/events.3.1.log

subtask  name               aarch64    armh    i586  ppc64le  x86_64
    #20  deepin-log-viewer   failed  failed  failed   failed  failed

2023-Mar-24 11:58:05 :: test-only task #317383 for sisyphus resumed by lvol:
#20 build 6.0.6-alt1 from /people/lvol/packages/deepin-log-viewer.git fetched at 2023-Mar-24 11:57:45
#40 removed
#100 removed
2023-Mar-24 11:58:07 :: [ppc64le] #20 deepin-log-viewer.git 6.0.6-alt1: build start
2023-Mar-24 11:58:07 :: [i586] #20 deepin-log-viewer.git 6.0.6-alt1: build start
2023-Mar-24 11:58:07 :: [armh] #20 deepin-log-viewer.git 6.0.6-alt1: build start
2023-Mar-24 11:58:07 :: [x86_64] #20 deepin-log-viewer.git 6.0.6-alt1: build start
2023-Mar-24 11:58:07 :: [aarch64] #20 deepin-log-viewer.git 6.0.6-alt1: build start
[i586] Verifying ELF objects in /usr/src/tmp/deepin-log-viewer-buildroot (arch=normal,fhs=normal,lfs=relaxed,lint=relaxed,rpath=normal,stack=normal,textrel=normal,unresolved=normal)
[i586] verify-elf: ERROR: ./usr/lib/liblogviewerplugin.so.0.1.0: undefined symbol: _ZN20LogApplicationHelper7m_mutexE
[i586] verify-elf: ERROR: ./usr/lib/liblogviewerplugin.so.0.1.0: undefined symbol: _ZN20LogApplicationHelper10m_instanceE
[i586] verify-elf: ERROR: ./usr/lib/liblogviewerplugin.so.0.1.0: undefined symbol: tmpfileplus
[i586] verify-elf: ERROR: ./usr/lib/liblogviewerplugin.so.0.1.0: undefined symbol: _ZN20LogApplicationHelper14getPathByAppIdERK7QString
[i586] verify-elf: ERROR: ./usr/lib/liblogviewerplugin.so.0.1.0: undefined symbol: _ZN11DocxFactory20WordProcessingMerger17setClipboardValueERKNSt7__cxx1112basic_stringIcSt11char_traitsIcESaIcEEES8_S8_
[i586] verify-elf: ERROR: ./usr/lib/liblogviewerplugin.so.0.1.0: undefined symbol: zipClose
[i586] verify-elf: ERROR: ./usr/lib/liblogviewerplugin.so.0.1.0: undefined symbol: _ZN20LogApplicationHelperC1EP7QObject
[i586] verify-elf: ERROR: ./usr/lib/liblogviewerplugin.so.0.1.0: undefined symbol: lxw_md5_init
[i586] verify-elf: ERROR: ./usr/lib/liblogviewerplugin.so.0.1.0: undefined symbol: zipCloseFileInZip
[i586] verify-elf: ERROR: ./usr/lib/liblogviewerplugin.so.0.1.0: undefined symbol: _ZN20LogApplicationHelper9transNameERK7QString
[i586] verify-elf: ERROR: ./usr/lib/liblogviewerplugin.so.0.1.0: undefined symbol: _ZN11DocxFactory20WordProcessingMerger11getInstanceEv
2023-Mar-24 11:59:11 :: [i586] deepin-log-viewer.git 6.0.6-alt1: remote: build failed
2023-Mar-24 11:59:11 :: [i586] #20 deepin-log-viewer.git 6.0.6-alt1: build FAILED
2023-Mar-24 11:59:11 :: [i586] requesting cancellation of task processing
[x86_64] Verifying ELF objects in /usr/src/tmp/deepin-log-viewer-buildroot (arch=normal,fhs=normal,lfs=relaxed,lint=relaxed,rpath=normal,stack=normal,textrel=normal,unresolved=normal)
[x86_64] verify-elf: ERROR: ./usr/lib64/liblogviewerplugin.so.0.1.0: undefined symbol: _ZN20LogApplicationHelper7m_mutexE
[x86_64] verify-elf: ERROR: ./usr/lib64/liblogviewerplugin.so.0.1.0: undefined symbol: _ZN20LogApplicationHelper10m_instanceE
[x86_64] verify-elf: ERROR: ./usr/lib64/liblogviewerplugin.so.0.1.0: undefined symbol: tmpfileplus
[x86_64] verify-elf: ERROR: ./usr/lib64/liblogviewerplugin.so.0.1.0: undefined symbol: _ZN20LogApplicationHelper14getPathByAppIdERK7QString
[x86_64] verify-elf: ERROR: ./usr/lib64/liblogviewerplugin.so.0.1.0: undefined symbol: _ZN11DocxFactory20WordProcessingMerger17setClipboardValueERKNSt7__cxx1112basic_stringIcSt11char_traitsIcESaIcEEES8_S8_
[x86_64] verify-elf: ERROR: ./usr/lib64/liblogviewerplugin.so.0.1.0: undefined symbol: zipClose
[x86_64] verify-elf: ERROR: ./usr/lib64/liblogviewerplugin.so.0.1.0: undefined symbol: _ZN20LogApplicationHelperC1EP7QObject
[x86_64] verify-elf: ERROR: ./usr/lib64/liblogviewerplugin.so.0.1.0: undefined symbol: lxw_md5_init
[x86_64] verify-elf: ERROR: ./usr/lib64/liblogviewerplugin.so.0.1.0: undefined symbol: zipCloseFileInZip
[x86_64] verify-elf: ERROR: ./usr/lib64/liblogviewerplugin.so.0.1.0: undefined symbol: _ZN20LogApplicationHelper9transNameERK7QString
[x86_64] verify-elf: ERROR: ./usr/lib64/liblogviewerplugin.so.0.1.0: undefined symbol: _ZN11DocxFactory20WordProcessingMerger11getInstanceEv
2023-Mar-24 11:59:14 :: [x86_64] deepin-log-viewer.git 6.0.6-alt1: remote: build failed
2023-Mar-24 11:59:14 :: [x86_64] #20 deepin-log-viewer.git 6.0.6-alt1: build FAILED
[aarch64] Verifying ELF objects in /usr/src/tmp/deepin-log-viewer-buildroot (arch=normal,fhs=normal,lfs=relaxed,lint=relaxed,rpath=normal,stack=normal,textrel=normal,unresolved=normal)
[aarch64] verify-elf: ERROR: ./usr/lib64/liblogviewerplugin.so.0.1.0: undefined symbol: _ZN20LogApplicationHelper7m_mutexE
[aarch64] verify-elf: ERROR: ./usr/lib64/liblogviewerplugin.so.0.1.0: undefined symbol: _ZN20LogApplicationHelper10m_instanceE
[aarch64] verify-elf: ERROR: ./usr/lib64/liblogviewerplugin.so.0.1.0: undefined symbol: tmpfileplus
[aarch64] verify-elf: ERROR: ./usr/lib64/liblogviewerplugin.so.0.1.0: undefined symbol: _ZN20LogApplicationHelper14getPathByAppIdERK7QString
[aarch64] verify-elf: ERROR: ./usr/lib64/liblogviewerplugin.so.0.1.0: undefined symbol: _ZN11DocxFactory20WordProcessingMerger17setClipboardValueERKNSt7__cxx1112basic_stringIcSt11char_traitsIcESaIcEEES8_S8_
[aarch64] verify-elf: ERROR: ./usr/lib64/liblogviewerplugin.so.0.1.0: undefined symbol: zipClose
[aarch64] verify-elf: ERROR: ./usr/lib64/liblogviewerplugin.so.0.1.0: undefined symbol: _ZN20LogApplicationHelperC1EP7QObject
[aarch64] verify-elf: ERROR: ./usr/lib64/liblogviewerplugin.so.0.1.0: undefined symbol: lxw_md5_init
[aarch64] verify-elf: ERROR: ./usr/lib64/liblogviewerplugin.so.0.1.0: undefined symbol: zipCloseFileInZip
[aarch64] verify-elf: ERROR: ./usr/lib64/liblogviewerplugin.so.0.1.0: undefined symbol: _ZN20LogApplicationHelper9transNameERK7QString
[aarch64] verify-elf: ERROR: ./usr/lib64/liblogviewerplugin.so.0.1.0: undefined symbol: _ZN11DocxFactory20WordProcessingMerger11getInstanceEv
2023-Mar-24 12:00:08 :: [aarch64] deepin-log-viewer.git 6.0.6-alt1: remote: build failed
2023-Mar-24 12:00:08 :: [aarch64] #20 deepin-log-viewer.git 6.0.6-alt1: build FAILED
[ppc64le] Verifying ELF objects in /usr/src/tmp/deepin-log-viewer-buildroot (arch=normal,fhs=normal,lfs=relaxed,lint=relaxed,rpath=normal,stack=normal,textrel=normal,unresolved=normal)
[ppc64le] verify-elf: ERROR: ./usr/lib64/liblogviewerplugin.so.0.1.0: undefined symbol: _ZN20LogApplicationHelper10m_instanceE
[ppc64le] verify-elf: ERROR: ./usr/lib64/liblogviewerplugin.so.0.1.0: undefined symbol: _ZN20LogApplicationHelper7m_mutexE
[ppc64le] verify-elf: ERROR: ./usr/lib64/liblogviewerplugin.so.0.1.0: undefined symbol: tmpfileplus
[ppc64le] verify-elf: ERROR: ./usr/lib64/liblogviewerplugin.so.0.1.0: undefined symbol: _ZN20LogApplicationHelper14getPathByAppIdERK7QString
[ppc64le] verify-elf: ERROR: ./usr/lib64/liblogviewerplugin.so.0.1.0: undefined symbol: _ZN11DocxFactory20WordProcessingMerger17setClipboardValueERKNSt7__cxx1112basic_stringIcSt11char_traitsIcESaIcEEES8_S8_
[ppc64le] verify-elf: ERROR: ./usr/lib64/liblogviewerplugin.so.0.1.0: undefined symbol: zipClose
[ppc64le] verify-elf: ERROR: ./usr/lib64/liblogviewerplugin.so.0.1.0: undefined symbol: _ZN20LogApplicationHelperC1EP7QObject
[ppc64le] verify-elf: ERROR: ./usr/lib64/liblogviewerplugin.so.0.1.0: undefined symbol: lxw_md5_init
[ppc64le] verify-elf: ERROR: ./usr/lib64/liblogviewerplugin.so.0.1.0: undefined symbol: zipCloseFileInZip
[ppc64le] verify-elf: ERROR: ./usr/lib64/liblogviewerplugin.so.0.1.0: undefined symbol: _ZN20LogApplicationHelper9transNameERK7QString
[ppc64le] verify-elf: ERROR: ./usr/lib64/liblogviewerplugin.so.0.1.0: undefined symbol: _ZN11DocxFactory20WordProcessingMerger11getInstanceEv
2023-Mar-24 12:00:23 :: [ppc64le] deepin-log-viewer.git 6.0.6-alt1: remote: build failed
2023-Mar-24 12:00:23 :: [ppc64le] #20 deepin-log-viewer.git 6.0.6-alt1: build FAILED
[armh] verify-elf: WARNING: ./usr/lib/liblogviewerplugin.so.0.1.0: skipping eu-elflint by request
[armh] verify-elf: ERROR: ./usr/lib/liblogviewerplugin.so.0.1.0: undefined symbol: _ZN20LogApplicationHelper7m_mutexE
[armh] verify-elf: ERROR: ./usr/lib/liblogviewerplugin.so.0.1.0: undefined symbol: _ZN20LogApplicationHelper10m_instanceE
[armh] verify-elf: ERROR: ./usr/lib/liblogviewerplugin.so.0.1.0: undefined symbol: tmpfileplus
[armh] verify-elf: ERROR: ./usr/lib/liblogviewerplugin.so.0.1.0: undefined symbol: _ZN20LogApplicationHelper14getPathByAppIdERK7QString
[armh] verify-elf: ERROR: ./usr/lib/liblogviewerplugin.so.0.1.0: undefined symbol: _ZN11DocxFactory20WordProcessingMerger17setClipboardValueERKNSt7__cxx1112basic_stringIcSt11char_traitsIcESaIcEEES8_S8_
[armh] verify-elf: ERROR: ./usr/lib/liblogviewerplugin.so.0.1.0: undefined symbol: zipClose
[armh] verify-elf: ERROR: ./usr/lib/liblogviewerplugin.so.0.1.0: undefined symbol: _ZN20LogApplicationHelperC1EP7QObject
[armh] verify-elf: ERROR: ./usr/lib/liblogviewerplugin.so.0.1.0: undefined symbol: lxw_md5_init
[armh] verify-elf: ERROR: ./usr/lib/liblogviewerplugin.so.0.1.0: undefined symbol: zipCloseFileInZip
[armh] verify-elf: ERROR: ./usr/lib/liblogviewerplugin.so.0.1.0: undefined symbol: _ZN20LogApplicationHelper9transNameERK7QString
[armh] verify-elf: ERROR: ./usr/lib/liblogviewerplugin.so.0.1.0: undefined symbol: _ZN11DocxFactory20WordProcessingMerger11getInstanceEv
2023-Mar-24 12:00:36 :: [armh] deepin-log-viewer.git 6.0.6-alt1: remote: build failed
2023-Mar-24 12:00:36 :: [armh] #20 deepin-log-viewer.git 6.0.6-alt1: build FAILED
2023-Mar-24 11:59:11 :: [i586] build FAILED
2023-Mar-24 11:59:14 :: [x86_64] build FAILED
2023-Mar-24 12:00:08 :: [aarch64] build FAILED
2023-Mar-24 12:00:23 :: [ppc64le] build FAILED
2023-Mar-24 12:00:36 :: [armh] build FAILED
2023-Mar-24 12:00:36 :: task #317383 for sisyphus FAILED


More information about the Sisyphus-incominger mailing list