[#316954] FAILED shadowsocks-rust.git=1.15.3-alt1

Girar awaiter (vt) girar-builder at altlinux.org
Sat Mar 18 15:20:49 MSK 2023


https://git.altlinux.org/tasks/316954/logs/events.1.1.log

subtask  name              aarch64   armh    i586  ppc64le  x86_64
   #100  shadowsocks-rust     6:39  10:16  failed   failed    3:25

2023-Mar-18 12:10:32 :: task #316954 for sisyphus started by vt:
#100 build 1.15.3-alt1 from /people/vt/packages/shadowsocks-rust.git fetched at 2023-Mar-18 12:10:30
2023-Mar-18 12:10:33 :: [i586] #100 shadowsocks-rust.git 1.15.3-alt1: build start
2023-Mar-18 12:10:33 :: [x86_64] #100 shadowsocks-rust.git 1.15.3-alt1: build start
2023-Mar-18 12:10:33 :: [ppc64le] #100 shadowsocks-rust.git 1.15.3-alt1: build start
2023-Mar-18 12:10:33 :: [aarch64] #100 shadowsocks-rust.git 1.15.3-alt1: build start
2023-Mar-18 12:10:33 :: [armh] #100 shadowsocks-rust.git 1.15.3-alt1: build start
[i586]      Running `rustc --crate-name aes_gcm --edition=2021 /usr/src/RPM/BUILD/shadowsocks-rust-1.15.3/vendor/aes-gcm/src/lib.rs --error-format=json --json=diagnostic-rendered-ansi,artifacts,future-incompat --crate-type lib --emit=dep-info,metadata,link -C opt-level=3 -C panic=abort -C linker-plugin-lto -C codegen-units=1 --cfg 'feature="aes"' --cfg 'feature="alloc"' --cfg 'feature="default"' --cfg 'feature="getrandom"' -C metadata=a9cb727fef9ee3f8 -C extra-filename=-a9cb727fef9ee3f8 --out-dir /usr/src/RPM/BUILD/shadowsocks-rust-1.15.3/target/release/deps -L dependency=/usr/src/RPM/BUILD/shadowsocks-rust-1.15.3/target/release/deps --extern aead=/usr/src/RPM/BUILD/shadowsocks-rust-1.15.3/target/release/deps/libaead-a6d4e73801ad3430.rmeta --extern aes=/usr/src/RPM/BUILD/shadowsocks-rust-1.15.3/target/release/deps/libaes-5deb3ec675c97826.rmeta --extern cipher=/usr/src/RPM/BUILD/shadowsocks-rust-1.15.3/target/release/deps/libcipher-56ddad32ab699e4f.rmeta --extern ctr=/usr/src/RPM/BUILD/shadowsocks-rust-1.15.3/target/release/deps/libctr-ec536ac5cc1b40b5.rmeta --extern ghash=/usr/src/RPM/BUILD/shadowsocks-rust-1.15.3/target/release/deps/libghash-3e4379a9c4d06264.rmeta --extern subtle=/usr/src/RPM/BUILD/shadowsocks-rust-1.15.3/target/release/deps/libsubtle-d5ea90bb7bffd4d4.rmeta --cap-lints allow -Copt-level=3 -Cdebuginfo=1`
[i586] error: could not find native static library `rustix_outline_x86`, perhaps an -L flag is missing?
[i586] error: could not compile `rustix` due to previous error
[i586] Caused by:
2023-Mar-18 12:11:26 :: [i586] shadowsocks-rust.git 1.15.3-alt1: remote: build failed
2023-Mar-18 12:11:27 :: [i586] #100 shadowsocks-rust.git 1.15.3-alt1: build FAILED
2023-Mar-18 12:11:27 :: [i586] requesting cancellation of task processing
[ppc64le]      Running `rustc --crate-name clap --edition=2021 /usr/src/RPM/BUILD/shadowsocks-rust-1.15.3/vendor/clap/src/lib.rs --error-format=json --json=diagnostic-rendered-ansi,artifacts,future-incompat --crate-type lib --emit=dep-info,metadata,link -C opt-level=3 -C panic=abort -C linker-plugin-lto -C codegen-units=1 --cfg 'feature="color"' --cfg 'feature="default"' --cfg 'feature="error-context"' --cfg 'feature="help"' --cfg 'feature="std"' --cfg 'feature="suggestions"' --cfg 'feature="usage"' --cfg 'feature="wrap_help"' -C metadata=a2d74c1b1009c2eb -C extra-filename=-a2d74c1b1009c2eb --out-dir /usr/src/RPM/BUILD/shadowsocks-rust-1.15.3/target/release/deps -L dependency=/usr/src/RPM/BUILD/shadowsocks-rust-1.15.3/target/release/deps --extern bitflags=/usr/src/RPM/BUILD/shadowsocks-rust-1.15.3/target/release/deps/libbitflags-b172e23cc8b9689b.rmeta --extern clap_lex=/usr/src/RPM/BUILD/shadowsocks-rust-1.15.3/target/release/deps/libclap_lex-8030645ed7bf86d7.rmeta --extern is_terminal=/usr/src/RPM/BUILD/shadowsocks-rust-1.15.3/target/release/deps/libis_terminal-4f846b818dde88f4.rmeta --extern strsim=/usr/src/RPM/BUILD/shadowsocks-rust-1.15.3/target/release/deps/libstrsim-ec0d6467d5ca5fce.rmeta --extern termcolor=/usr/src/RPM/BUILD/shadowsocks-rust-1.15.3/target/release/deps/libtermcolor-b0f76c9d6dfdcd4c.rmeta --extern terminal_size=/usr/src/RPM/BUILD/shadowsocks-rust-1.15.3/target/release/deps/libterminal_size-077645b40f9dba44.rmeta --cap-lints allow -Copt-level=3 -Cdebuginfo=1 -L src/backend/linux_raw/arch/outline/release`
[ppc64le] error: could not find native static library `rustix_outline_powerpc64`, perhaps an -L flag is missing?
[ppc64le] error: could not compile `rustix` due to previous error
[ppc64le] Caused by:
2023-Mar-18 12:12:11 :: [ppc64le] shadowsocks-rust.git 1.15.3-alt1: remote: build failed
2023-Mar-18 12:12:11 :: [ppc64le] #100 shadowsocks-rust.git 1.15.3-alt1: build FAILED
2023-Mar-18 12:13:58 :: [x86_64] #100 shadowsocks-rust.git 1.15.3-alt1: build OK
2023-Mar-18 12:17:12 :: [aarch64] #100 shadowsocks-rust.git 1.15.3-alt1: build OK
2023-Mar-18 12:20:49 :: [armh] #100 shadowsocks-rust.git 1.15.3-alt1: build OK
2023-Mar-18 12:11:27 :: [i586] build FAILED
2023-Mar-18 12:12:11 :: [ppc64le] build FAILED
2023-Mar-18 12:20:49 :: task #316954 for sisyphus FAILED


More information about the Sisyphus-incominger mailing list