[#316896] [test-only] FAILED pgaudit.git=1.7.0-alt1
Girar awaiter (cas)
girar-builder at altlinux.org
Fri Mar 17 18:05:33 MSK 2023
https://git.altlinux.org/tasks/316896/logs/events.1.1.log
subtask name aarch64 armh i586 ppc64le x86_64
#100 pgaudit failed failed failed failed failed
2023-Mar-17 15:04:13 :: test-only task #316896 for sisyphus started by cas:
#100 build 1.7.0-alt1 from /people/cas/packages/pgaudit.git fetched at 2023-Mar-17 15:04:06
2023-Mar-17 15:04:15 :: [ppc64le] #100 pgaudit.git 1.7.0-alt1: build start
2023-Mar-17 15:04:15 :: [i586] #100 pgaudit.git 1.7.0-alt1: build start
2023-Mar-17 15:04:15 :: [armh] #100 pgaudit.git 1.7.0-alt1: build start
2023-Mar-17 15:04:15 :: [aarch64] #100 pgaudit.git 1.7.0-alt1: build start
2023-Mar-17 15:04:15 :: [x86_64] #100 pgaudit.git 1.7.0-alt1: build start
[i586] + make -j32
[i586] Makefile:20: ../../src/Makefile.global: No such file or directory
[i586] make: *** No rule to make target '../../src/Makefile.global'. Stop.
2023-Mar-17 15:04:40 :: [i586] pgaudit.git 1.7.0-alt1: remote: build failed
2023-Mar-17 15:04:40 :: [i586] #100 pgaudit.git 1.7.0-alt1: build FAILED
2023-Mar-17 15:04:40 :: [i586] requesting cancellation of task processing
[x86_64] + make -j32
[x86_64] Makefile:20: ../../src/Makefile.global: No such file or directory
[x86_64] make: *** No rule to make target '../../src/Makefile.global'. Stop.
2023-Mar-17 15:04:53 :: [x86_64] pgaudit.git 1.7.0-alt1: remote: build failed
2023-Mar-17 15:04:53 :: [x86_64] #100 pgaudit.git 1.7.0-alt1: build FAILED
[armh] + make -j32
[armh] Makefile:20: ../../src/Makefile.global: No such file or directory
[armh] make: *** No rule to make target '../../src/Makefile.global'. Stop.
2023-Mar-17 15:05:15 :: [armh] pgaudit.git 1.7.0-alt1: remote: build failed
2023-Mar-17 15:05:15 :: [armh] #100 pgaudit.git 1.7.0-alt1: build FAILED
[aarch64] + make -j24
[aarch64] Makefile:20: ../../src/Makefile.global: No such file or directory
[aarch64] make: *** No rule to make target '../../src/Makefile.global'. Stop.
2023-Mar-17 15:05:20 :: [aarch64] pgaudit.git 1.7.0-alt1: remote: build failed
2023-Mar-17 15:05:20 :: [aarch64] #100 pgaudit.git 1.7.0-alt1: build FAILED
[ppc64le] + make -j43
[ppc64le] Makefile:20: ../../src/Makefile.global: No such file or directory
[ppc64le] make: *** No rule to make target '../../src/Makefile.global'. Stop.
2023-Mar-17 15:05:33 :: [ppc64le] pgaudit.git 1.7.0-alt1: remote: build failed
2023-Mar-17 15:05:33 :: [ppc64le] #100 pgaudit.git 1.7.0-alt1: build FAILED
2023-Mar-17 15:04:40 :: [i586] build FAILED
2023-Mar-17 15:04:53 :: [x86_64] build FAILED
2023-Mar-17 15:05:15 :: [armh] build FAILED
2023-Mar-17 15:05:20 :: [aarch64] build FAILED
2023-Mar-17 15:05:33 :: [ppc64le] build FAILED
2023-Mar-17 15:05:33 :: task #316896 for sisyphus FAILED
More information about the Sisyphus-incominger
mailing list