[#323373] FAILED gpui.git=0.2.27-alt1

Girar awaiter (august) girar-builder at altlinux.org
Tue Jun 20 18:19:08 MSK 2023


https://git.altlinux.org/tasks/323373/logs/events.1.1.log

subtask  name  aarch64    armh  i586  ppc64le  x86_64
   #100  gpui     3:36  failed  1:59     3:29    1:50

2023-Jun-20 15:15:30 :: task #323373 for sisyphus started by august:
#100 build 0.2.27-alt1 from /people/august/packages/gpui.git fetched at 2023-Jun-20 15:15:28
2023-Jun-20 15:15:31 :: [x86_64] #100 gpui.git 0.2.27-alt1: build start
2023-Jun-20 15:15:31 :: [ppc64le] #100 gpui.git 0.2.27-alt1: build start
2023-Jun-20 15:15:31 :: [aarch64] #100 gpui.git 0.2.27-alt1: build start
2023-Jun-20 15:15:31 :: [i586] #100 gpui.git 0.2.27-alt1: build start
2023-Jun-20 15:15:31 :: [armh] #100 gpui.git 0.2.27-alt1: build start
[armh] cd /usr/src/RPM/BUILD/gpui-0.2.27/armh-alt-linux-gnueabi/src/plugins/storage/smb && /usr/bin/c++ -DQT_CORE_LIB -DQT_NO_DEBUG -I/usr/include/samba-4.0 -isystem /usr/include/qt5 -isystem /usr/include/qt5/QtCore -isystem /usr/share/qt5/../../lib/qt5/mkspecs/linux-g++ -pipe -frecord-gcc-switches -Wall -g -O2 -flto=auto -fomit-frame-pointer -march=armv7-a -mthumb -Wno-undef -fvisibility=hidden -fvisibility-inlines-hidden -pedantic -Wall        -Wextra -Wno-long-long -Weffc++ -Werror -Wall -Wextra -pedantic -Wcast-align -Wcast-qual -Wctor-dtor-privacy         -Wdisabled-optimization -Wformat=2 -Winit-self -Wlogical-op -Wmissing-include-dirs -Wnoexcept -Wold-style-cast         -Woverloaded-virtual -Wredundant-decls -Wshadow -Wstrict-null-sentinel -Wundef         -Wno-unused -Wno-variadic-macros -Wno-parentheses -Wnonnull -fdiagnostics-show-option -march=i586 -fPIC -MD -MT src/plugins/storage/smb/CMakeFiles/smb-storage-static.dir/smbstorageplugin.cpp.o -MF CMakeFiles/smb-storage-static.dir/smbstorageplugin.cpp.o.d -o CMakeFiles/smb-storage-static.dir/smbstorageplugin.cpp.o -c /usr/src/RPM/BUILD/gpui-0.2.27/src/plugins/storage/smb/smbstorageplugin.cpp
[armh] armh-alt-linux-gnueabi-g++: error: unrecognized -march target: i586
[armh] armh-alt-linux-gnueabi-g++: note: valid arguments are: armv4 armv4t armv5t armv5te armv5tej armv6 armv6j armv6k armv6z armv6kz armv6zk armv6t2 armv6-m armv6s-m armv7 armv7-a armv7ve armv7-r armv7-m armv7e-m armv8-a armv8.1-a armv8.2-a armv8.3-a armv8.4-a armv8.5-a armv8.6-a armv8-m.base armv8-m.main armv8-r armv8.1-m.main armv9-a iwmmxt iwmmxt2 native
[armh] armh-alt-linux-gnueabi-g++: error: missing argument to '-march='
[armh] gmake[2]: *** [src/plugins/storage/smb/CMakeFiles/smb-storage-static.dir/build.make:118: src/plugins/storage/smb/CMakeFiles/smb-storage-static.dir/smbstorageplugin.cpp.o] Error 1
2023-Jun-20 15:16:54 :: [armh] gpui.git 0.2.27-alt1: remote: build failed
2023-Jun-20 15:16:54 :: [armh] #100 gpui.git 0.2.27-alt1: build FAILED
2023-Jun-20 15:16:54 :: [armh] requesting cancellation of task processing
2023-Jun-20 15:17:21 :: [x86_64] #100 gpui.git 0.2.27-alt1: build OK
2023-Jun-20 15:17:30 :: [i586] #100 gpui.git 0.2.27-alt1: build OK
2023-Jun-20 15:19:00 :: [ppc64le] #100 gpui.git 0.2.27-alt1: build OK
2023-Jun-20 15:19:07 :: [aarch64] #100 gpui.git 0.2.27-alt1: build OK
2023-Jun-20 15:16:54 :: [armh] build FAILED
2023-Jun-20 15:19:07 :: task #323373 for sisyphus FAILED


More information about the Sisyphus-incominger mailing list