[#322910] [test-only] FAILED (try 2) libpcap.git=1.10.4-alt1 tcpdump.git=4.99.4-alt1
Girar awaiter (arseny)
girar-builder at altlinux.org
Tue Jun 13 17:53:34 MSK 2023
https://git.altlinux.org/tasks/322910/logs/events.2.1.log
subtask name aarch64 armh i586 ppc64le x86_64
#140 tcpdump 1:11 ? failed 1:13 36
2023-Jun-13 14:51:37 :: test-only task #322910 for sisyphus resumed by arseny:
#100 build 1.10.4-alt1 from /people/arseny/packages/libpcap.git fetched at 2023-Jun-13 12:55:25
#140 build 4.99.4-alt1 from /people/arseny/packages/tcpdump.git fetched at 2023-Jun-13 14:49:42
#200 removed
2023-Jun-13 14:51:38 :: created build repo
2023-Jun-13 14:51:39 :: [i586] #100 libpcap.git 1.10.4-alt1: build start
2023-Jun-13 14:51:39 :: [ppc64le] #100 libpcap.git 1.10.4-alt1: build start
2023-Jun-13 14:51:39 :: [aarch64] #100 libpcap.git 1.10.4-alt1: build start
2023-Jun-13 14:51:39 :: [x86_64] #100 libpcap.git 1.10.4-alt1: build start
2023-Jun-13 14:51:39 :: [armh] #100 libpcap.git 1.10.4-alt1: build start
2023-Jun-13 14:51:53 :: [i586] #100 libpcap.git 1.10.4-alt1: build OK (cached)
2023-Jun-13 14:51:54 :: [i586] #140 tcpdump.git 4.99.4-alt1: build start
2023-Jun-13 14:51:54 :: [x86_64] #100 libpcap.git 1.10.4-alt1: build OK (cached)
2023-Jun-13 14:51:54 :: [x86_64] #140 tcpdump.git 4.99.4-alt1: build start
2023-Jun-13 14:52:12 :: [aarch64] #100 libpcap.git 1.10.4-alt1: build OK (cached)
2023-Jun-13 14:52:12 :: [aarch64] #140 tcpdump.git 4.99.4-alt1: build start
2023-Jun-13 14:52:21 :: [ppc64le] #100 libpcap.git 1.10.4-alt1: build OK (cached)
2023-Jun-13 14:52:21 :: [ppc64le] #140 tcpdump.git 4.99.4-alt1: build start
[i586] FILE: /usr/src/RPM/BUILD/tcpdump-4.99.4-alt1/tests/lmp-v.tests
[i586] lmp-v-fptype1 : TEST FAILED(exit core=0/diffstat=1,0/r=256)
[i586] lmp-v-fptype2 : skipped (HAVE_FPTYPE2 not set)
[i586] --
[i586] smb_data_print-segv-nosmb : passed
[i586] 1 tests failed
[i586] 581 tests passed
[i586] Failed test: lmp-v-fptype1
[i586] --- /usr/src/RPM/BUILD/tcpdump-4.99.4-alt1/tests/lmp-v-fptype1.out 2023-06-13 14:46:01.000000000 +0000
2023-Jun-13 14:52:22 :: [i586] tcpdump.git 4.99.4-alt1: remote: build failed
2023-Jun-13 14:52:22 :: [i586] #140 tcpdump.git 4.99.4-alt1: build FAILED
2023-Jun-13 14:52:22 :: [i586] requesting cancellation of task processing
2023-Jun-13 14:52:25 :: [armh] #100 libpcap.git 1.10.4-alt1: build OK (cached)
2023-Jun-13 14:52:25 :: [armh] task processing CANCELLED
2023-Jun-13 14:52:30 :: [x86_64] #140 tcpdump.git 4.99.4-alt1: build OK
2023-Jun-13 14:53:23 :: [aarch64] #140 tcpdump.git 4.99.4-alt1: build OK
2023-Jun-13 14:53:34 :: [ppc64le] #140 tcpdump.git 4.99.4-alt1: build OK
2023-Jun-13 14:52:22 :: [i586] build FAILED
2023-Jun-13 14:52:25 :: [armh] build FAILED
2023-Jun-13 14:53:34 :: task #322910 for sisyphus FAILED
More information about the Sisyphus-incominger
mailing list