[#322696] FAILED python3-module-big-O.git=0.11.0-alt1 ...

Girar awaiter (slev) girar-builder at altlinux.org
Fri Jun 9 17:57:15 MSK 2023


https://git.altlinux.org/tasks/322696/logs/events.1.1.log

subtask  name                  aarch64  armh    i586  ppc64le  x86_64
   #200  python3-module-big-O     1:29  2:15  failed     2:03  failed

2023-Jun-09 14:54:57 :: task #322696 for sisyphus started by slev:
#100 removed
#200 build 0.11.0-alt1 from /people/slev/packages/python3-module-big-O.git fetched at 2023-Jun-09 14:16:18
#300 build 6.3.0-alt1.1 from /people/slev/packages/python3-module-jaraco.itertools.git fetched at 2023-Jun-09 14:51:01
#400 build 3.15.0-alt2 from /people/slev/packages/python3-module-zipp.git fetched at 2023-Jun-09 14:54:39
2023-Jun-09 14:54:58 :: created build repo
2023-Jun-09 14:54:59 :: [x86_64] #200 python3-module-big-O.git 0.11.0-alt1: build start
2023-Jun-09 14:54:59 :: [ppc64le] #200 python3-module-big-O.git 0.11.0-alt1: build start
2023-Jun-09 14:54:59 :: [i586] #200 python3-module-big-O.git 0.11.0-alt1: build start
2023-Jun-09 14:54:59 :: [armh] #200 python3-module-big-O.git 0.11.0-alt1: build start
2023-Jun-09 14:54:59 :: [aarch64] #200 python3-module-big-O.git 0.11.0-alt1: build start
[x86_64]                     .format(res_class, residuals, sol_class, sol_residuals))
[x86_64] E           AssertionError: <big_o.complexities.Linear object at 0x7f6b5a5a9ad0> is not an instance of <class 'big_o.complexities.Linearithmic'> : Best matched complexity is Linear: time = -0.00057 + 3.5E-06*n (sec) (r=0.000003) when Linearithmic: time = 7.5E-05 + 4.1E-07*n*log(n) (sec) (r=0.000003) was expected
[x86_64] big_o/test/test_big_o.py:155: AssertionError
[x86_64] --
[x86_64] SKIPPED [1] big_o/test/test_big_o.py:94: Unstable: https://github.com/pberkes/big_O/pull/49
[x86_64] FAILED big_o/test/test_big_o.py::TestBigO::test_big_o - AssertionError: <big_...
[x86_64] =================== 1 failed, 22 passed, 1 skipped in 11.01s ===================
[x86_64] INFO     : Command's result: FAILURE
[x86_64] INFO     : Command's error: Command '['python3', '-m', 'pytest', '-ra', '-Wignore', 'big_o/test']' returned non-zero exit status 1.
2023-Jun-09 14:55:46 :: [x86_64] python3-module-big-O.git 0.11.0-alt1: remote: build failed
2023-Jun-09 14:55:46 :: [x86_64] #200 python3-module-big-O.git 0.11.0-alt1: build FAILED
2023-Jun-09 14:55:46 :: [x86_64] requesting cancellation of task processing
[i586]                     .format(res_class, residuals, sol_class, sol_residuals))
[i586] E           AssertionError: <big_o.complexities.Polynomial object at 0xdde7c050> is not an instance of <class 'big_o.complexities.Linearithmic'> : Best matched complexity is Polynomial: time = 1.1E-06 * x^1.2 (sec) (r=0.000005) when Linearithmic: time = -0.0002 + 5.9E-07*n*log(n) (sec) (r=0.000005) was expected
[i586] big_o/test/test_big_o.py:155: AssertionError
[i586] --
[i586] SKIPPED [1] big_o/test/test_big_o.py:94: Unstable: https://github.com/pberkes/big_O/pull/49
[i586] FAILED big_o/test/test_big_o.py::TestBigO::test_big_o - AssertionError: <big_...
[i586] =================== 1 failed, 22 passed, 1 skipped in 12.29s ===================
[i586] INFO     : Command's result: FAILURE
[i586] INFO     : Command's error: Command '['python3', '-m', 'pytest', '-ra', '-Wignore', 'big_o/test']' returned non-zero exit status 1.
2023-Jun-09 14:55:50 :: [i586] python3-module-big-O.git 0.11.0-alt1: remote: build failed
2023-Jun-09 14:55:50 :: [i586] #200 python3-module-big-O.git 0.11.0-alt1: build FAILED
2023-Jun-09 14:56:28 :: [aarch64] #200 python3-module-big-O.git 0.11.0-alt1: build OK
2023-Jun-09 14:56:29 :: [aarch64] task processing CANCELLED
2023-Jun-09 14:57:02 :: [ppc64le] #200 python3-module-big-O.git 0.11.0-alt1: build OK
2023-Jun-09 14:57:02 :: [ppc64le] task processing CANCELLED
2023-Jun-09 14:57:14 :: [armh] #200 python3-module-big-O.git 0.11.0-alt1: build OK
2023-Jun-09 14:57:14 :: [armh] task processing CANCELLED
2023-Jun-09 14:55:47 :: [x86_64] build FAILED
2023-Jun-09 14:55:50 :: [i586] build FAILED
2023-Jun-09 14:56:29 :: [aarch64] build FAILED
2023-Jun-09 14:57:02 :: [ppc64le] build FAILED
2023-Jun-09 14:57:14 :: [armh] build FAILED
2023-Jun-09 14:57:15 :: task #322696 for sisyphus FAILED


More information about the Sisyphus-incominger mailing list