[#324111] [test-only] FAILED kernel-modules.git=sisyphus/kernel-modules-anbox-pine-14-alt2.gae26ba2
Girar awaiter (shrek)
girar-builder at altlinux.org
Mon Jul 3 09:40:49 MSK 2023
https://git.altlinux.org/tasks/324111/logs/events.1.1.log
subtask name aarch64 armh i586 ppc64le x86_64
#100 @kernel-modules-anbox-pine failed - failed failed failed
2023-Jul-03 06:40:02 :: test-only task #324111 for sisyphus started by shrek:
#100 build sisyphus/kernel-modules-anbox-pine-14-alt2.gae26ba2 from /people/shrek/packages/kernel-modules.git fetched at 2023-Jul-03 06:40:01
2023-Jul-03 06:40:04 :: [i586] #100 kernel-modules.git sisyphus/kernel-modules-anbox-pine-14-alt2.gae26ba2: build start
2023-Jul-03 06:40:04 :: [ppc64le] #100 kernel-modules.git sisyphus/kernel-modules-anbox-pine-14-alt2.gae26ba2: build start
2023-Jul-03 06:40:04 :: [armh] #100 kernel-modules.git sisyphus/kernel-modules-anbox-pine-14-alt2.gae26ba2: build start
2023-Jul-03 06:40:04 :: [x86_64] #100 kernel-modules.git sisyphus/kernel-modules-anbox-pine-14-alt2.gae26ba2: build start
2023-Jul-03 06:40:04 :: [aarch64] #100 kernel-modules.git sisyphus/kernel-modules-anbox-pine-14-alt2.gae26ba2: build start
[x86_64] Reading Package Lists...
[x86_64] Building Dependency Tree...
[x86_64] E: Couldn't find package kernel-headers-modules-pine
[x86_64] hsh-install: Failed to calculate package file list.
[x86_64] hsh-install: Failed to generate package file list.
2023-Jul-03 06:40:20 :: [x86_64] kernel-modules.git sisyphus/kernel-modules-anbox-pine-14-alt2.gae26ba2: remote: cannot build src.rpm
2023-Jul-03 06:40:20 :: [x86_64] #100 kernel-modules.git sisyphus/kernel-modules-anbox-pine-14-alt2.gae26ba2: build FAILED
2023-Jul-03 06:40:20 :: [x86_64] requesting cancellation of task processing
[i586] Reading Package Lists...
[i586] Building Dependency Tree...
[i586] E: Couldn't find package kernel-headers-modules-pine
[i586] hsh-install: Failed to calculate package file list.
[i586] hsh-install: Failed to generate package file list.
2023-Jul-03 06:40:21 :: [i586] kernel-modules.git sisyphus/kernel-modules-anbox-pine-14-alt2.gae26ba2: remote: cannot build src.rpm
2023-Jul-03 06:40:21 :: [i586] #100 kernel-modules.git sisyphus/kernel-modules-anbox-pine-14-alt2.gae26ba2: build FAILED
[ppc64le] Reading Package Lists...
[ppc64le] Building Dependency Tree...
[ppc64le] E: Couldn't find package kernel-headers-modules-pine
[ppc64le] hsh-install: Failed to calculate package file list.
[ppc64le] hsh-install: Failed to generate package file list.
2023-Jul-03 06:40:36 :: [ppc64le] kernel-modules.git sisyphus/kernel-modules-anbox-pine-14-alt2.gae26ba2: remote: cannot build src.rpm
2023-Jul-03 06:40:36 :: [ppc64le] #100 kernel-modules.git sisyphus/kernel-modules-anbox-pine-14-alt2.gae26ba2: build FAILED
[armh] Reading Package Lists...
[armh] Building Dependency Tree...
[armh] E: Couldn't find package kernel-headers-modules-pine
[armh] hsh-install: Failed to calculate package file list.
[armh] hsh-install: Failed to generate package file list.
2023-Jul-03 06:40:45 :: [armh] kernel-modules.git sisyphus/kernel-modules-anbox-pine-14-alt2.gae26ba2: remote: cannot build src.rpm, but we don't care
2023-Jul-03 06:40:46 :: [armh] #100 kernel-modules.git sisyphus/kernel-modules-anbox-pine-14-alt2.gae26ba2: build SKIPPED
[aarch64] make: Entering directory '/usr/src/linux-6.2.14-pine-alt3'
[aarch64] /bin/sh: ./scripts/pahole-flags.sh: No such file or directory
[aarch64] make: Leaving directory '/usr/src/linux-6.2.14-pine-alt3'
[aarch64] make: Entering directory '/usr/src/linux-6.2.14-pine-alt3'
[aarch64] /bin/sh: ./scripts/pahole-flags.sh: No such file or directory
[aarch64] warning: the compiler differs from the one used to build the kernel
[aarch64] --
[aarch64] make -f ./scripts/Makefile.build obj=/usr/src/RPM/BUILD/kernel-source-anbox-14/binder need-builtin=1 need-modorder=1
[aarch64] /bin/sh: ./scripts/pahole-flags.sh: No such file or directory
[aarch64] printf '%s\n' deps.o binder.o binder_alloc.o binderfs.o | awk '!x[$0]++ { print("/usr/src/RPM/BUILD/kernel-source-anbox-14/binder/"$0) }' > /usr/src/RPM/BUILD/kernel-source-anbox-14/binder/binder_linux.mod
[aarch64] --
[aarch64] ./scripts/check-local-export /usr/src/RPM/BUILD/kernel-source-anbox-14/binder/deps.o
[aarch64] /bin/sh: ./scripts/check-local-export: No such file or directory
[aarch64] make[1]: *** [scripts/Makefile.build:252: /usr/src/RPM/BUILD/kernel-source-anbox-14/binder/deps.o] Error 127
[aarch64] --
[aarch64] ./scripts/check-local-export /usr/src/RPM/BUILD/kernel-source-anbox-14/binder/binderfs.o
[aarch64] /bin/sh: ./scripts/check-local-export: No such file or directory
[aarch64] make[1]: *** [scripts/Makefile.build:252: /usr/src/RPM/BUILD/kernel-source-anbox-14/binder/binderfs.o] Error 127
[aarch64] --
[aarch64] ./scripts/check-local-export /usr/src/RPM/BUILD/kernel-source-anbox-14/binder/binder_alloc.o
[aarch64] /bin/sh: ./scripts/check-local-export: No such file or directory
[aarch64] make[1]: *** [scripts/Makefile.build:252: /usr/src/RPM/BUILD/kernel-source-anbox-14/binder/binder_alloc.o] Error 127
[aarch64] --
[aarch64] ./scripts/check-local-export /usr/src/RPM/BUILD/kernel-source-anbox-14/binder/binder.o
[aarch64] /bin/sh: ./scripts/check-local-export: No such file or directory
[aarch64] make[1]: *** [scripts/Makefile.build:252: /usr/src/RPM/BUILD/kernel-source-anbox-14/binder/binder.o] Error 127
2023-Jul-03 06:40:49 :: [aarch64] kernel-modules.git sisyphus/kernel-modules-anbox-pine-14-alt2.gae26ba2: remote: build failed
2023-Jul-03 06:40:49 :: [aarch64] #100 kernel-modules.git sisyphus/kernel-modules-anbox-pine-14-alt2.gae26ba2: build FAILED
2023-Jul-03 06:40:20 :: [x86_64] build FAILED
2023-Jul-03 06:40:22 :: [i586] build FAILED
2023-Jul-03 06:40:36 :: [ppc64le] build FAILED
2023-Jul-03 06:40:49 :: [aarch64] build FAILED
2023-Jul-03 06:40:49 :: task #324111 for sisyphus FAILED
More information about the Sisyphus-incominger
mailing list