[#337202] FAILED qt6-serialbus.git=6.6.1-alt1

Girar awaiter (zerg) girar-builder at altlinux.org
Mon Dec 25 14:57:38 MSK 2023


https://git.altlinux.org/tasks/337202/logs/events.1.1.log

subtask  name           aarch64    armh    i586  ppc64le  x86_64
   #100  qt6-serialbus   failed  failed  failed   failed  failed

2023-Dec-25 11:56:26 :: task #337202 for sisyphus started by zerg:
#100 build 6.6.1-alt1 from /people/zerg/packages/qt6-serialbus.git fetched at 2023-Dec-25 11:56:24
2023-Dec-25 11:56:27 :: [x86_64] #100 qt6-serialbus.git 6.6.1-alt1: build start
2023-Dec-25 11:56:27 :: [armh] #100 qt6-serialbus.git 6.6.1-alt1: build start
2023-Dec-25 11:56:27 :: [aarch64] #100 qt6-serialbus.git 6.6.1-alt1: build start
2023-Dec-25 11:56:27 :: [i586] #100 qt6-serialbus.git 6.6.1-alt1: build start
2023-Dec-25 11:56:27 :: [ppc64le] #100 qt6-serialbus.git 6.6.1-alt1: build start
[x86_64] + export QTDIR=/usr/share/qt6
[x86_64] + QTDIR=/usr/share/qt6
[x86_64] + export 'CFLAGS=-pipe -frecord-gcc-switches -Wall -g -O2 -flto=auto'
[x86_64] + CFLAGS='-pipe -frecord-gcc-switches -Wall -g -O2 -flto=auto'
[x86_64] + export 'CXXFLAGS=-pipe -frecord-gcc-switches -Wall -g -O2 -flto=auto'
[x86_64] + CXXFLAGS='-pipe -frecord-gcc-switches -Wall -g -O2 -flto=auto'
[x86_64] + pushd BUILD
[x86_64] ~/RPM/BUILD/qtserialbus-everywhere-src-6.6.1/BUILD ~/RPM/BUILD/qtserialbus-everywhere-src-6.6.1
[x86_64] + cmake .. '-GUnix Makefiles' -DCMAKE_BUILD_TYPE=RelWithDebInfo -DCMAKE_INSTALL_PREFIX=/usr -DINSTALL_ARCHDATADIR=/usr/lib64/qt6 -DINSTALL_BINDIR=/usr/share/qt6/bin -DINSTALL_DATADIR=/usr/share/qt6 -DINSTALL_DOCDIR=/usr/share/doc/qt6 -DINSTALL_EXAMPLESDIR=/usr/lib64/qt6/examples -DQT_INSTALL_EXAMPLES_SOURCES:BOOL=ON -DINSTALL_INCLUDEDIR=/usr/include/qt6 -DINSTALL_QMLDIR=/usr/lib64/qt6/qml -DINSTALL_LIBDIR=/usr/lib64 -DINSTALL_LIBEXECDIR=/usr/lib64/qt6/libexec -DINSTALL_PLUGINSDIR=/usr/lib64/qt6/plugins -DINSTALL_SYSCONFDIR=/etc/xdg -DINSTALL_TRANSLATIONSDIR=/usr/share/qt6/translations -DINSTALL_MKSPECSDIR=/usr/lib64/qt6/mkspecs -DQT_DISABLE_RPATH:BOOL=TRUE
[x86_64] /usr/src/tmp/rpm-tmp.65539: line 136: cmake: command not found
2023-Dec-25 11:56:53 :: [x86_64] qt6-serialbus.git 6.6.1-alt1: remote: build failed
2023-Dec-25 11:56:53 :: [x86_64] #100 qt6-serialbus.git 6.6.1-alt1: build FAILED
2023-Dec-25 11:56:53 :: [x86_64] requesting cancellation of task processing
[i586] + export QTDIR=/usr/share/qt6
[i586] + QTDIR=/usr/share/qt6
[i586] + export 'CFLAGS=-pipe -frecord-gcc-switches -Wall -g -O2 -flto=auto -march=i586 -mtune=generic'
[i586] + CFLAGS='-pipe -frecord-gcc-switches -Wall -g -O2 -flto=auto -march=i586 -mtune=generic'
[i586] + export 'CXXFLAGS=-pipe -frecord-gcc-switches -Wall -g -O2 -flto=auto -march=i586 -mtune=generic'
[i586] + CXXFLAGS='-pipe -frecord-gcc-switches -Wall -g -O2 -flto=auto -march=i586 -mtune=generic'
[i586] + pushd BUILD
[i586] ~/RPM/BUILD/qtserialbus-everywhere-src-6.6.1/BUILD ~/RPM/BUILD/qtserialbus-everywhere-src-6.6.1
[i586] + cmake .. '-GUnix Makefiles' -DCMAKE_BUILD_TYPE=RelWithDebInfo -DCMAKE_INSTALL_PREFIX=/usr -DINSTALL_ARCHDATADIR=/usr/lib/qt6 -DINSTALL_BINDIR=/usr/share/qt6/bin -DINSTALL_DATADIR=/usr/share/qt6 -DINSTALL_DOCDIR=/usr/share/doc/qt6 -DINSTALL_EXAMPLESDIR=/usr/lib/qt6/examples -DQT_INSTALL_EXAMPLES_SOURCES:BOOL=ON -DINSTALL_INCLUDEDIR=/usr/include/qt6 -DINSTALL_QMLDIR=/usr/lib/qt6/qml -DINSTALL_LIBDIR=/usr/lib -DINSTALL_LIBEXECDIR=/usr/lib/qt6/libexec -DINSTALL_PLUGINSDIR=/usr/lib/qt6/plugins -DINSTALL_SYSCONFDIR=/etc/xdg -DINSTALL_TRANSLATIONSDIR=/usr/share/qt6/translations -DINSTALL_MKSPECSDIR=/usr/lib/qt6/mkspecs -DQT_DISABLE_RPATH:BOOL=TRUE
[i586] /usr/src/tmp/rpm-tmp.20236: line 136: cmake: command not found
2023-Dec-25 11:56:56 :: [i586] qt6-serialbus.git 6.6.1-alt1: remote: build failed
2023-Dec-25 11:56:56 :: [i586] #100 qt6-serialbus.git 6.6.1-alt1: build FAILED
[aarch64] + export QTDIR=/usr/share/qt6
[aarch64] + QTDIR=/usr/share/qt6
[aarch64] + export 'CFLAGS=-pipe -frecord-gcc-switches -Wall -g -O2 -flto=auto'
[aarch64] + CFLAGS='-pipe -frecord-gcc-switches -Wall -g -O2 -flto=auto'
[aarch64] + export 'CXXFLAGS=-pipe -frecord-gcc-switches -Wall -g -O2 -flto=auto'
[aarch64] + CXXFLAGS='-pipe -frecord-gcc-switches -Wall -g -O2 -flto=auto'
[aarch64] + pushd BUILD
[aarch64] ~/RPM/BUILD/qtserialbus-everywhere-src-6.6.1/BUILD ~/RPM/BUILD/qtserialbus-everywhere-src-6.6.1
[aarch64] + cmake .. '-GUnix Makefiles' -DCMAKE_BUILD_TYPE=RelWithDebInfo -DCMAKE_INSTALL_PREFIX=/usr -DINSTALL_ARCHDATADIR=/usr/lib64/qt6 -DINSTALL_BINDIR=/usr/share/qt6/bin -DINSTALL_DATADIR=/usr/share/qt6 -DINSTALL_DOCDIR=/usr/share/doc/qt6 -DINSTALL_EXAMPLESDIR=/usr/lib64/qt6/examples -DQT_INSTALL_EXAMPLES_SOURCES:BOOL=ON -DINSTALL_INCLUDEDIR=/usr/include/qt6 -DINSTALL_QMLDIR=/usr/lib64/qt6/qml -DINSTALL_LIBDIR=/usr/lib64 -DINSTALL_LIBEXECDIR=/usr/lib64/qt6/libexec -DINSTALL_PLUGINSDIR=/usr/lib64/qt6/plugins -DINSTALL_SYSCONFDIR=/etc/xdg -DINSTALL_TRANSLATIONSDIR=/usr/share/qt6/translations -DINSTALL_MKSPECSDIR=/usr/lib64/qt6/mkspecs -DQT_DISABLE_RPATH:BOOL=TRUE
[aarch64] /usr/src/tmp/rpm-tmp.51946: line 136: cmake: command not found
2023-Dec-25 11:57:16 :: [aarch64] qt6-serialbus.git 6.6.1-alt1: remote: build failed
2023-Dec-25 11:57:16 :: [aarch64] #100 qt6-serialbus.git 6.6.1-alt1: build FAILED
[ppc64le] + export QTDIR=/usr/share/qt6
[ppc64le] + QTDIR=/usr/share/qt6
[ppc64le] + export 'CFLAGS=-pipe -frecord-gcc-switches -Wall -g -O2 -flto=auto'
[ppc64le] + CFLAGS='-pipe -frecord-gcc-switches -Wall -g -O2 -flto=auto'
[ppc64le] + export 'CXXFLAGS=-pipe -frecord-gcc-switches -Wall -g -O2 -flto=auto'
[ppc64le] + CXXFLAGS='-pipe -frecord-gcc-switches -Wall -g -O2 -flto=auto'
[ppc64le] + pushd BUILD
[ppc64le] ~/RPM/BUILD/qtserialbus-everywhere-src-6.6.1/BUILD ~/RPM/BUILD/qtserialbus-everywhere-src-6.6.1
[ppc64le] + cmake .. '-GUnix Makefiles' -DCMAKE_BUILD_TYPE=RelWithDebInfo -DCMAKE_INSTALL_PREFIX=/usr -DINSTALL_ARCHDATADIR=/usr/lib64/qt6 -DINSTALL_BINDIR=/usr/share/qt6/bin -DINSTALL_DATADIR=/usr/share/qt6 -DINSTALL_DOCDIR=/usr/share/doc/qt6 -DINSTALL_EXAMPLESDIR=/usr/lib64/qt6/examples -DQT_INSTALL_EXAMPLES_SOURCES:BOOL=ON -DINSTALL_INCLUDEDIR=/usr/include/qt6 -DINSTALL_QMLDIR=/usr/lib64/qt6/qml -DINSTALL_LIBDIR=/usr/lib64 -DINSTALL_LIBEXECDIR=/usr/lib64/qt6/libexec -DINSTALL_PLUGINSDIR=/usr/lib64/qt6/plugins -DINSTALL_SYSCONFDIR=/etc/xdg -DINSTALL_TRANSLATIONSDIR=/usr/share/qt6/translations -DINSTALL_MKSPECSDIR=/usr/lib64/qt6/mkspecs -DQT_DISABLE_RPATH:BOOL=TRUE
[ppc64le] /usr/src/tmp/rpm-tmp.28514: line 136: cmake: command not found
2023-Dec-25 11:57:21 :: [ppc64le] qt6-serialbus.git 6.6.1-alt1: remote: build failed
2023-Dec-25 11:57:21 :: [ppc64le] #100 qt6-serialbus.git 6.6.1-alt1: build FAILED
[armh] + export QTDIR=/usr/share/qt6
[armh] + QTDIR=/usr/share/qt6
[armh] + export 'CFLAGS=-pipe -frecord-gcc-switches -Wall -g -O2 -flto=auto -fomit-frame-pointer -march=armv7-a -mthumb'
[armh] + CFLAGS='-pipe -frecord-gcc-switches -Wall -g -O2 -flto=auto -fomit-frame-pointer -march=armv7-a -mthumb'
[armh] + export 'CXXFLAGS=-pipe -frecord-gcc-switches -Wall -g -O2 -flto=auto -fomit-frame-pointer -march=armv7-a -mthumb'
[armh] + CXXFLAGS='-pipe -frecord-gcc-switches -Wall -g -O2 -flto=auto -fomit-frame-pointer -march=armv7-a -mthumb'
[armh] + pushd BUILD
[armh] ~/RPM/BUILD/qtserialbus-everywhere-src-6.6.1/BUILD ~/RPM/BUILD/qtserialbus-everywhere-src-6.6.1
[armh] + cmake .. '-GUnix Makefiles' -DCMAKE_BUILD_TYPE=RelWithDebInfo -DCMAKE_INSTALL_PREFIX=/usr -DINSTALL_ARCHDATADIR=/usr/lib/qt6 -DINSTALL_BINDIR=/usr/share/qt6/bin -DINSTALL_DATADIR=/usr/share/qt6 -DINSTALL_DOCDIR=/usr/share/doc/qt6 -DINSTALL_EXAMPLESDIR=/usr/lib/qt6/examples -DQT_INSTALL_EXAMPLES_SOURCES:BOOL=ON -DINSTALL_INCLUDEDIR=/usr/include/qt6 -DINSTALL_QMLDIR=/usr/lib/qt6/qml -DINSTALL_LIBDIR=/usr/lib -DINSTALL_LIBEXECDIR=/usr/lib/qt6/libexec -DINSTALL_PLUGINSDIR=/usr/lib/qt6/plugins -DINSTALL_SYSCONFDIR=/etc/xdg -DINSTALL_TRANSLATIONSDIR=/usr/share/qt6/translations -DINSTALL_MKSPECSDIR=/usr/lib/qt6/mkspecs -DQT_DISABLE_RPATH:BOOL=TRUE
[armh] /usr/src/tmp/rpm-tmp.6475: line 136: cmake: command not found
2023-Dec-25 11:57:38 :: [armh] qt6-serialbus.git 6.6.1-alt1: remote: build failed
2023-Dec-25 11:57:38 :: [armh] #100 qt6-serialbus.git 6.6.1-alt1: build FAILED
2023-Dec-25 11:56:53 :: [x86_64] build FAILED
2023-Dec-25 11:56:56 :: [i586] build FAILED
2023-Dec-25 11:57:16 :: [aarch64] build FAILED
2023-Dec-25 11:57:21 :: [ppc64le] build FAILED
2023-Dec-25 11:57:38 :: [armh] build FAILED
2023-Dec-25 11:57:38 :: task #337202 for sisyphus FAILED


More information about the Sisyphus-incominger mailing list