[#310517] [test-only] FAILED telegram-desktop.git=4.3.1-alt1
Girar awaiter (lav)
girar-builder at altlinux.org
Wed Nov 23 23:52:15 MSK 2022
https://git.altlinux.org/tasks/310517/logs/events.1.1.log
subtask name aarch64 armh i586 ppc64le x86_64
#100 telegram-desktop - - failed - failed
2022-Nov-23 20:51:08 :: test-only task #310517 for sisyphus started by lav:
#100 build 4.3.1-alt1 from /people/lav/packages/telegram-desktop.git fetched at 2022-Nov-23 20:51:06
2022-Nov-23 20:51:09 :: [aarch64] #100 telegram-desktop.git 4.3.1-alt1: build start
2022-Nov-23 20:51:09 :: [armh] #100 telegram-desktop.git 4.3.1-alt1: build start
2022-Nov-23 20:51:09 :: [i586] #100 telegram-desktop.git 4.3.1-alt1: build start
2022-Nov-23 20:51:09 :: [ppc64le] #100 telegram-desktop.git 4.3.1-alt1: build start
2022-Nov-23 20:51:09 :: [x86_64] #100 telegram-desktop.git 4.3.1-alt1: build start
2022-Nov-23 20:51:26 :: [aarch64] #100 telegram-desktop.git 4.3.1-alt1: build SKIPPED
2022-Nov-23 20:51:28 :: [ppc64le] #100 telegram-desktop.git 4.3.1-alt1: build SKIPPED
2022-Nov-23 20:51:35 :: [armh] #100 telegram-desktop.git 4.3.1-alt1: build SKIPPED
[x86_64] /usr/src/RPM/BUILD/telegram-desktop-4.3.1/Telegram/lib_base/base/platform/linux/base_file_utilities_linux.cpp: In function 'bool base::Platform::{anonymous}::PortalShowInFolder(const QString&)':
[x86_64] /usr/src/RPM/BUILD/telegram-desktop-4.3.1/Telegram/lib_base/base/platform/linux/base_file_utilities_linux.cpp:41:45: error: 'SESSION' is not a member of 'Gio::DBus::BusType'
[x86_64] 41 | Gio::DBus::BusType::SESSION);
[x86_64] /usr/src/RPM/BUILD/telegram-desktop-4.3.1/Telegram/lib_base/base/platform/linux/base_file_utilities_linux.cpp: In function 'bool base::Platform::{anonymous}::DBusShowInFolder(const QString&)':
[x86_64] /usr/src/RPM/BUILD/telegram-desktop-4.3.1/Telegram/lib_base/base/platform/linux/base_file_utilities_linux.cpp:96:45: error: 'SESSION' is not a member of 'Gio::DBus::BusType'
[x86_64] 96 | Gio::DBus::BusType::SESSION);
[x86_64] --
[x86_64] /usr/src/RPM/BUILD/telegram-desktop-4.3.1/Telegram/lib_base/base/platform/linux/base_last_input_linux.cpp: In lambda function:
[x86_64] /usr/src/RPM/BUILD/telegram-desktop-4.3.1/Telegram/lib_base/base/platform/linux/base_last_input_linux.cpp:76:61: error: 'SESSION' is not a member of 'Gio::DBus::BusType'
[x86_64] 76 | Gio::DBus::BusType::SESSION);
[x86_64] /usr/src/RPM/BUILD/telegram-desktop-4.3.1/Telegram/lib_base/base/platform/linux/base_last_input_linux.cpp: In lambda function:
[x86_64] /usr/src/RPM/BUILD/telegram-desktop-4.3.1/Telegram/lib_base/base/platform/linux/base_last_input_linux.cpp:137:61: error: 'SESSION' is not a member of 'Gio::DBus::BusType'
[x86_64] 137 | Gio::DBus::BusType::SESSION);
[x86_64] --
[x86_64] /usr/src/RPM/BUILD/telegram-desktop-4.3.1/Telegram/lib_base/base/platform/linux/base_linux_xdp_utilities.cpp: In function 'std::optional<Glib::VariantBase> base::Platform::XDP::ReadSetting(const Glib::ustring&, const Glib::ustring&)':
[x86_64] /usr/src/RPM/BUILD/telegram-desktop-4.3.1/Telegram/lib_base/base/platform/linux/base_linux_xdp_utilities.cpp:43:45: error: 'SESSION' is not a member of 'Gio::DBus::BusType'
[x86_64] 43 | Gio::DBus::BusType::SESSION);
[x86_64] /usr/src/RPM/BUILD/telegram-desktop-4.3.1/Telegram/lib_base/base/platform/linux/base_linux_xdp_utilities.cpp: In constructor 'base::Platform::XDP::SettingWatcher::SettingWatcher(Fn<void(const Glib::ustring&, const Glib::ustring&, const Glib::VariantBase&)>)':
[x86_64] /usr/src/RPM/BUILD/telegram-desktop-4.3.1/Telegram/lib_base/base/platform/linux/base_linux_xdp_utilities.cpp:77:45: error: 'SESSION' is not a member of 'Gio::DBus::BusType'
[x86_64] 77 | Gio::DBus::BusType::SESSION);
[x86_64] --
[x86_64] /usr/src/RPM/BUILD/telegram-desktop-4.3.1/Telegram/lib_base/base/platform/linux/base_url_scheme_linux.cpp: In function 'void base::Platform::{anonymous}::SnapDefaultHandler(const QString&)':
[x86_64] /usr/src/RPM/BUILD/telegram-desktop-4.3.1/Telegram/lib_base/base/platform/linux/base_url_scheme_linux.cpp:39:45: error: 'SESSION' is not a member of 'Gio::DBus::BusType'
[x86_64] 39 | Gio::DBus::BusType::SESSION);
[x86_64] /usr/src/RPM/BUILD/telegram-desktop-4.3.1/Telegram/lib_base/base/platform/linux/base_url_scheme_linux.cpp: In function 'void base::Platform::RegisterUrlScheme(const UrlSchemeDescriptor&)':
[x86_64] /usr/src/RPM/BUILD/telegram-desktop-4.3.1/Telegram/lib_base/base/platform/linux/base_url_scheme_linux.cpp:150:39: error: 'Gio::AppInfo::CreateFlags' has not been declared
[x86_64] 150 | Gio::AppInfo::CreateFlags::SUPPORTS_URIS);
[x86_64] --
[x86_64] /usr/src/RPM/BUILD/telegram-desktop-4.3.1/Telegram/lib_base/base/platform/linux/base_system_media_controls_linux.cpp: In lambda function:
[x86_64] /usr/src/RPM/BUILD/telegram-desktop-4.3.1/Telegram/lib_base/base/platform/linux/base_system_media_controls_linux.cpp:262:45: error: 'SESSION' is not a member of 'Gio::DBus::BusType'
[x86_64] 262 | Gio::DBus::BusType::SESSION);
[x86_64] /usr/src/RPM/BUILD/telegram-desktop-4.3.1/Telegram/lib_base/base/platform/linux/base_system_media_controls_linux.cpp: In lambda function:
[x86_64] /usr/src/RPM/BUILD/telegram-desktop-4.3.1/Telegram/lib_base/base/platform/linux/base_system_media_controls_linux.cpp:286:45: error: 'SESSION' is not a member of 'Gio::DBus::BusType'
[x86_64] 286 | Gio::DBus::BusType::SESSION,
2022-Nov-23 20:52:09 :: [x86_64] telegram-desktop.git 4.3.1-alt1: remote: build failed
2022-Nov-23 20:52:09 :: [x86_64] #100 telegram-desktop.git 4.3.1-alt1: build FAILED
2022-Nov-23 20:52:09 :: [x86_64] requesting cancellation of task processing
[i586] /usr/src/RPM/BUILD/telegram-desktop-4.3.1/Telegram/lib_base/base/platform/linux/base_last_input_linux.cpp: In lambda function:
[i586] /usr/src/RPM/BUILD/telegram-desktop-4.3.1/Telegram/lib_base/base/platform/linux/base_last_input_linux.cpp:76:61: error: 'SESSION' is not a member of 'Gio::DBus::BusType'
[i586] 76 | Gio::DBus::BusType::SESSION);
[i586] /usr/src/RPM/BUILD/telegram-desktop-4.3.1/Telegram/lib_base/base/platform/linux/base_last_input_linux.cpp: In lambda function:
[i586] /usr/src/RPM/BUILD/telegram-desktop-4.3.1/Telegram/lib_base/base/platform/linux/base_last_input_linux.cpp:137:61: error: 'SESSION' is not a member of 'Gio::DBus::BusType'
[i586] 137 | Gio::DBus::BusType::SESSION);
[i586] --
[i586] /usr/src/RPM/BUILD/telegram-desktop-4.3.1/Telegram/lib_base/base/platform/linux/base_file_utilities_linux.cpp: In function 'bool base::Platform::{anonymous}::PortalShowInFolder(const QString&)':
[i586] /usr/src/RPM/BUILD/telegram-desktop-4.3.1/Telegram/lib_base/base/platform/linux/base_file_utilities_linux.cpp:41:45: error: 'SESSION' is not a member of 'Gio::DBus::BusType'
[i586] 41 | Gio::DBus::BusType::SESSION);
[i586] /usr/src/RPM/BUILD/telegram-desktop-4.3.1/Telegram/lib_base/base/platform/linux/base_file_utilities_linux.cpp: In function 'bool base::Platform::{anonymous}::DBusShowInFolder(const QString&)':
[i586] /usr/src/RPM/BUILD/telegram-desktop-4.3.1/Telegram/lib_base/base/platform/linux/base_file_utilities_linux.cpp:96:45: error: 'SESSION' is not a member of 'Gio::DBus::BusType'
[i586] 96 | Gio::DBus::BusType::SESSION);
[i586] --
[i586] /usr/src/RPM/BUILD/telegram-desktop-4.3.1/Telegram/lib_base/base/platform/linux/base_linux_xdp_utilities.cpp: In function 'std::optional<Glib::VariantBase> base::Platform::XDP::ReadSetting(const Glib::ustring&, const Glib::ustring&)':
[i586] /usr/src/RPM/BUILD/telegram-desktop-4.3.1/Telegram/lib_base/base/platform/linux/base_linux_xdp_utilities.cpp:43:45: error: 'SESSION' is not a member of 'Gio::DBus::BusType'
[i586] 43 | Gio::DBus::BusType::SESSION);
[i586] /usr/src/RPM/BUILD/telegram-desktop-4.3.1/Telegram/lib_base/base/platform/linux/base_linux_xdp_utilities.cpp: In constructor 'base::Platform::XDP::SettingWatcher::SettingWatcher(Fn<void(const Glib::ustring&, const Glib::ustring&, const Glib::VariantBase&)>)':
[i586] /usr/src/RPM/BUILD/telegram-desktop-4.3.1/Telegram/lib_base/base/platform/linux/base_linux_xdp_utilities.cpp:77:45: error: 'SESSION' is not a member of 'Gio::DBus::BusType'
[i586] 77 | Gio::DBus::BusType::SESSION);
[i586] --
[i586] /usr/src/RPM/BUILD/telegram-desktop-4.3.1/Telegram/lib_base/base/platform/linux/base_url_scheme_linux.cpp: In function 'void base::Platform::{anonymous}::SnapDefaultHandler(const QString&)':
[i586] /usr/src/RPM/BUILD/telegram-desktop-4.3.1/Telegram/lib_base/base/platform/linux/base_url_scheme_linux.cpp:39:45: error: 'SESSION' is not a member of 'Gio::DBus::BusType'
[i586] 39 | Gio::DBus::BusType::SESSION);
[i586] /usr/src/RPM/BUILD/telegram-desktop-4.3.1/Telegram/lib_base/base/platform/linux/base_url_scheme_linux.cpp: In function 'void base::Platform::RegisterUrlScheme(const UrlSchemeDescriptor&)':
[i586] /usr/src/RPM/BUILD/telegram-desktop-4.3.1/Telegram/lib_base/base/platform/linux/base_url_scheme_linux.cpp:150:39: error: 'Gio::AppInfo::CreateFlags' has not been declared
[i586] 150 | Gio::AppInfo::CreateFlags::SUPPORTS_URIS);
[i586] --
[i586] /usr/src/RPM/BUILD/telegram-desktop-4.3.1/Telegram/lib_base/base/platform/linux/base_system_media_controls_linux.cpp: In lambda function:
[i586] /usr/src/RPM/BUILD/telegram-desktop-4.3.1/Telegram/lib_base/base/platform/linux/base_system_media_controls_linux.cpp:262:45: error: 'SESSION' is not a member of 'Gio::DBus::BusType'
[i586] 262 | Gio::DBus::BusType::SESSION);
[i586] /usr/src/RPM/BUILD/telegram-desktop-4.3.1/Telegram/lib_base/base/platform/linux/base_system_media_controls_linux.cpp: In lambda function:
[i586] /usr/src/RPM/BUILD/telegram-desktop-4.3.1/Telegram/lib_base/base/platform/linux/base_system_media_controls_linux.cpp:286:45: error: 'SESSION' is not a member of 'Gio::DBus::BusType'
[i586] 286 | Gio::DBus::BusType::SESSION,
2022-Nov-23 20:52:15 :: [i586] telegram-desktop.git 4.3.1-alt1: remote: build failed
2022-Nov-23 20:52:15 :: [i586] #100 telegram-desktop.git 4.3.1-alt1: build FAILED
2022-Nov-23 20:52:09 :: [x86_64] build FAILED
2022-Nov-23 20:52:15 :: [i586] build FAILED
2022-Nov-23 20:52:15 :: task #310517 for sisyphus FAILED
More information about the Sisyphus-incominger
mailing list